Dibenzotetra-aza-annulene nickel(II) complex

Phase change data

Data compiled by: William E. Acree, Jr., James S. Chickos

Enthalpy of sublimation

ΔsubH (kJ/mol) Temperature (K) Method Reference Comment
116.6 ± 5.5508.TFerro, Quagliata, et al., 1983Based on data from 463. - 553. K.

References

Ferro, Quagliata, et al., 1983
Ferro, Daniela; Quagliata, Claudio; Conte, Maria Rosaria, Stability of 11,12-benzofluoranthene choleic acid derived by pressure data, Thermochimica Acta, 1983, 60, 2, 211-217, https://doi.org/10.1016/0040-6031(83)80272-X . [all data]