Dibenzo[b,e][1,4]dioxin, 1,2,4-trichloro-
- Formula: C12H5Cl3O2
- Molecular weight: 287.526
- IUPAC Standard InChIKey: HRVUKLBFRPWXPJ-UHFFFAOYSA-N
- CAS Registry Number: 39227-58-2
- Chemical structure:
View 3d structure (requires JavaScript / HTML 5) - Other names: 1,2,4-Trichlorodibenzo-p-dioxin; Dibenzo-p-dioxin, 1,2,4-trichloro-; 1,2,4-Trichlorodibenzodioxin; 1,2,4-Trichlorodibenzo-para-dioxin; 1,2,4-Trichlorodibenzo[b,e] [1,4]dioxin

Phase change data

Data compiled by: William E. Acree, Jr., James S. Chickos
Enthalpy of sublimation
ΔsubH (kJ/mol) | Temperature (K) | Method | Reference | Comment |
---|---|---|---|---|
121.0 ± 1.8 | 365. | ME | Li, Shibata, et al., 2004 | Based on data from 348. to 383. K. |
118.8 | 342. | T | Rordorf, 1989 | Based on data from 310. to 374. K. See also Rordorf, 1986. |

References

Li, Shibata, et al., 2004
Li, Xian-Wei; Shibata, Etsuro; Kasai, Eiki; Nakamura, Takashi,
VAPOR PRESSURES AND ENTHALPIES OF SUBLIMATION OF 17 POLYCHLORINATED DIBENZO-p-DIOXINS AND FIVE POLYCHLORINATED DIBENZOFURANS,
Environ Toxicol Chem, 2004, 23, 2, 348-808, https://doi.org/10.1897/03-193
. [all data]
Rordorf, 1989
Rordorf, Berchtold F.,
Prediction of vapor pressures, boiling points and enthalpies of fusion for twenty-nine halogenated dibenzo-p-dioxins and fifty-five dibenzofurans by a vapor pressure correlation method,
Chemosphere, 1989, 18, 1-6, 783-788, https://doi.org/10.1016/0045-6535(89)90196-3
. [all data]
Rordorf, 1986
Rordorf, Berchtold F.,
Thermal properties of dioxins, furans and related compounds,
Chemosphere, 1986, 15, 9-12, 1325-1332, https://doi.org/10.1016/0045-6535(86)90407-8
. [all data]