Dibenzo[b,e][1,4]dioxin, 1-chloro-
- Formula: C12H7ClO2
- Molecular weight: 218.636
- IUPAC Standard InChIKey: VGGGRWRBGXENKI-UHFFFAOYSA-N
- CAS Registry Number: 39227-53-7
- Chemical structure:
View 3d structure (requires JavaScript / HTML 5) - Other names: 1-Chlorodibenzo-p-dioxin; Dibenzo-p-dioxin, 1-chloro-; 1-Chlorodibenzodioxin; 1-Chlorodibenzo[b,e] [1,4]dioxin

Phase change data

Data compiled as indicated in comments:
TRC - Thermodynamics Research Center, NIST Boulder Laboratories, Chris Muzny director
AC - William E. Acree, Jr., James S. Chickos
Quantity | Value | Units | Method | Reference | Comment |
---|---|---|---|---|---|
Tfus | 378. | K | N/A | Rordorf, 1986 | Uncertainty assigned by TRC = 1. K; TRC |
Quantity | Value | Units | Method | Reference | Comment |
ΔsubH° | 95.2 ± 1.1 | kJ/mol | C | Kolesov, Dorofeeva, et al., 1999 | AC |
Enthalpy of sublimation
ΔsubH (kJ/mol) | Temperature (K) | Method | Reference | Comment |
---|---|---|---|---|
100.5 ± 0.8 | 325. | ME | Li, Shibata, et al., 2004 | Based on data from 308. to 343. K.; AC |
98.6 | 321. | T | Rordorf, 1989 | Based on data from 303. to 338. K. See also Rordorf, 1986, 2.; AC |
Enthalpy of fusion
ΔfusH (kJ/mol) | Temperature (K) | Reference | Comment |
---|---|---|---|
23.2 | 378.2 | Rordorf, 1986, 3 | AC |

References

Rordorf, 1986
Rordorf, B.F.,
Proc. 5th Interna. Sympo. on Chlorinated Dioxins and Related Compounds, Bayreuth, 1986. [all data]
Kolesov, Dorofeeva, et al., 1999
Kolesov, Victor P.; Dorofeeva, Olga V.; Iorish, Vladimir S.; Papina, Tatiana S.; Lukyanova, Vera A.; Melkhanova, Svetlana V.,
Experimental measurements and a group additivity approach for estimating the standard molar enthalpies of formation of dioxins,
Mendeleev Communications, 1999, 9, 4, 143-144, https://doi.org/10.1070/MC1999v009n04ABEH001074
. [all data]
Li, Shibata, et al., 2004
Li, Xian-Wei; Shibata, Etsuro; Kasai, Eiki; Nakamura, Takashi,
VAPOR PRESSURES AND ENTHALPIES OF SUBLIMATION OF 17 POLYCHLORINATED DIBENZO-p-DIOXINS AND FIVE POLYCHLORINATED DIBENZOFURANS,
Environ Toxicol Chem, 2004, 23, 2, 348-808, https://doi.org/10.1897/03-193
. [all data]
Rordorf, 1989
Rordorf, Berchtold F.,
Prediction of vapor pressures, boiling points and enthalpies of fusion for twenty-nine halogenated dibenzo-p-dioxins and fifty-five dibenzofurans by a vapor pressure correlation method,
Chemosphere, 1989, 18, 1-6, 783-788, https://doi.org/10.1016/0045-6535(89)90196-3
. [all data]
Rordorf, 1986, 2
Rordorf, Berchtold F.,
Thermal properties of dioxins, furans and related compounds,
Chemosphere, 1986, 15, 9-12, 1325-1332, https://doi.org/10.1016/0045-6535(86)90407-8
. [all data]
Rordorf, 1986, 3
Rordorf, B.F.,
, Proceedings of the Fifth International Symposium on Chlorinated Dioxins and Related Compounds (16-19 September), Bayreuth, Germany, 1986. [all data]