1-bromo-4-(1-methylpropyl)benzene
- Formula: C10H13Br
- Molecular weight: 213.114
- IUPAC Standard InChIKey: DGZQEAKNZXNTNL-UHFFFAOYSA-N
- CAS Registry Number: 39220-69-4
- Chemical structure:
View 3d structure (requires JavaScript / HTML 5) - Permanent link for this species. Use this link for bookmarking this species for future reference.

Phase change data

Data compiled by: Thermodynamics Research Center, NIST Boulder Laboratories, Chris Muzny director
Quantity | Value | Units | Method | Reference | Comment |
---|---|---|---|---|---|
Tboil | 510.02 | K | N/A | Lamneck, 1954 | Uncertainty assigned by TRC = 0.3 K |
Quantity | Value | Units | Method | Reference | Comment |
Tfus | 231.80 | K | N/A | Lamneck, 1954 | Uncertainty assigned by TRC = 0.3 K |

References

Lamneck, 1954
Lamneck, J.H.,
Bromination of the two propylbenzenes and three butylbenzenes,
J. Am. Chem. Soc., 1954, 76, 1106. [all data]