cyclopropane, 1,2-dichloro-, trans-
- Formula: C3H4Cl2
- Molecular weight: 110.970
- IUPAC Standard InChIKey: YYQKBUMQNFGUGI-HRFVKAFMSA-N
- CAS Registry Number: 39199-87-6
- Chemical structure:
View 3d structure (requires JavaScript / HTML 5) - Stereoisomers:

Phase change data

Data compiled by: Thermodynamics Research Center, NIST Boulder Laboratories, Chris Muzny director
Quantity | Value | Units | Method | Reference | Comment |
---|---|---|---|---|---|
Tboil | 361.09 | K | N/A | Slabey, 1952 | Uncertainty assigned by TRC = 0.3 K |
Quantity | Value | Units | Method | Reference | Comment |
Tfus | 254.41 | K | N/A | Slabey, 1952 | Uncertainty assigned by TRC = 0.3 K |

References

Slabey, 1952
Slabey, V.A.,
Reaction of Cyclopropyl Chloride with Lithium. Isolation of Dicyclopropyl,
J. Am. Chem. Soc., 1952, 74, 4928-30. [all data]