Bis-(1,1,3,3-tetra-methylbutyl)diazene
- Formula: C16H34N2
- Molecular weight: 254.4546
- CAS Registry Number: 39198-34-0

Gas phase thermochemistry data

Data compiled by: Hussein Y. Afeefy, Joel F. Liebman, and Stephen E. Stein
Quantity | Value | Units | Method | Reference | Comment |
---|---|---|---|---|---|
ΔfH°gas | -47.0 ± 2.2 | kcal/mol | Ccb | Engel, Melaugh, et al., 1976 |

Condensed phase thermochemistry data

Data compiled by: Hussein Y. Afeefy, Joel F. Liebman, and Stephen E. Stein
Quantity | Value | Units | Method | Reference | Comment |
---|---|---|---|---|---|
ΔfH°liquid | -62.9 ± 2.2 | kcal/mol | Ccb | Engel, Melaugh, et al., 1976 | |
Quantity | Value | Units | Method | Reference | Comment |
ΔcH°liquid | -2603.2 ± 2.3 | kcal/mol | Ccb | Engel, Melaugh, et al., 1976 |

Phase change data

Data compiled as indicated in comments:
ALS - Hussein Y. Afeefy, Joel F. Liebman, and Stephen E. Stein
DRB - Donald R. Burgess, Jr.
AC - William E. Acree, Jr., James S. Chickos
Quantity | Value | Units | Method | Reference | Comment |
---|---|---|---|---|---|
ΔvapH° | 15.90 ± 0.15 | kcal/mol | V | Engel, Melaugh, et al., 1976 | ALS |
ΔvapH° | 15.8 | kcal/mol | N/A | Engel, Melaugh, et al., 1976 | DRB |
ΔvapH° | 15.9 ± 0.1 | kcal/mol | C | Engel, Melaugh, et al., 1976 | AC |

References

Engel, Melaugh, et al., 1976
Engel, P.S.; Melaugh, R.A.; Mansson, M.; Timberlake, J.W.; Garner, A.W.; Rossini, F.D.,
Thermochemistry of nine diazenes (azo compounds),
J. Chem. Thermodyn., 1976, 8, 607-621. [all data]