N-Isobutyl-sec-butylamine

Kovats' RI, non-polar column, isothermal

View large format table.

Column type Active phase Temperature (C) I Reference Comment
PackedApiezon L100.843.Golovnya, Zhuravleva, et al., 1982Chromosorb G AW (80-100 mesh); Column length: 2.7 m

References

Golovnya, Zhuravleva, et al., 1982
Golovnya, R.V.; Zhuravleva, I.L.; Svetlova, I.; Terenina, M.B.; Gutnik, S.B., Calculation of gas chromatographic retention indices of secondary amines from structural increments, Zh. Anal. Khim., 1982, 37, 294-300. [all data]