1-Propene, 3-(ethenyloxy)-
- Formula: C5H8O
- Molecular weight: 84.1164
- IUPAC Standard InChIKey: ZXABMDQSAABDMG-UHFFFAOYSA-N
- CAS Registry Number: 3917-15-5
- Chemical structure:
View 3d structure (requires JavaScript / HTML 5) - Other names: Ether, allyl vinyl; Allyl vinyl ether; Vinyl allyl ether

Phase change data

Data compiled by: Thermodynamics Research Center, NIST Boulder Laboratories, Chris Muzny director
Quantity | Value | Units | Method | Reference | Comment |
---|---|---|---|---|---|
Tfus | 168.7 | K | N/A | Anonymous, 1954 | Uncertainty assigned by TRC = 0.6 K |

Normal alkane RI, non-polar column, custom temperature program

Column type | Active phase | I | Reference | Comment |
---|---|---|---|---|
Capillary | SPB-5 | 864. | Lee and Kim, 2002 | 60. m/0.25 mm/0.25 μm, Helium; Program: 50 0C (3 min) 4 0C/min -> 200 0C 8 0C/min -> 240 0C (5 min) |

Normal alkane RI, polar column, custom temperature program

Column type | Active phase | I | Reference | Comment |
---|---|---|---|---|
Capillary | Supelcowax-10 | 1344. | Lee and Kim, 2002 | 30. m/0.32 mm/0.25 μm, Helium; Program: 40 0C (5 min) 4 0C/min -> 150 0C 8 0C/min -> 240 0C |

References

Anonymous, 1954
Anonymous, R.,
, Am. Pet. Inst. Res. Proj. 45, Tech. Rep. 13, Ohio State Univ., 1954. [all data]
Lee and Kim, 2002
Lee, D.-S.; Kim, N.-S.,
Identification of fragrances from chestnut blossom by gas chromatography-ion trap mass spectrometry,
Bull. Korean Chem. Soc., 2002, 23, 11, 1647-1650, https://doi.org/10.5012/bkcs.2002.23.11.1647
. [all data]