L-Alanine, N-methyl-
- Formula: C4H9NO2
- Molecular weight: 103.1198
- IUPAC Standard InChIKey: GDFAOVXKHJXLEI-GSVOUGTGSA-N
- CAS Registry Number: 3913-67-5
- Chemical structure:
View 3d structure (requires JavaScript / HTML 5) - Other names: Alanine, N-methyl-, L-; α-(Methylamino)propionic acid; L-N-Methylalanine; N-Methyl-L-alanine; N-Methylalanine

Reaction thermochemistry data

Data compiled by: Robert C. Dunbar
Individual Reactions
By formula: Na+ + C4H9NO2 = (Na+ • C4H9NO2)
Quantity | Value | Units | Method | Reference | Comment |
---|---|---|---|---|---|
ΔrH° | 176. ± 13. | kJ/mol | IMRE | Gapeev and Dunbar, 2003 | Anchor glycine=38.5+-2.7 |

Ion clustering data

Data compiled by: Robert C. Dunbar
Clustering reactions
By formula: Na+ + C4H9NO2 = (Na+ • C4H9NO2)
Quantity | Value | Units | Method | Reference | Comment |
---|---|---|---|---|---|
ΔrH° | 176. ± 13. | kJ/mol | IMRE | Gapeev and Dunbar, 2003 | Anchor glycine=38.5+-2.7 |

References

Gapeev and Dunbar, 2003
Gapeev, A.; Dunbar, R.C.,
Na+ Affinities of Gas-Phase Amino Acids by Ligand Exchange Equilibrium,
Int. J. Mass Spectrom., 2003, 228, 2-3, 825, https://doi.org/10.1016/S1387-3806(03)00242-2
. [all data]