1H-Indene, 2,3-dihydro-1,1,3-trimethyl-3-phenyl-
- Formula: C18H20
- Molecular weight: 236.3514
- IUPAC Standard InChIKey: ICLPNZMYHDVKKI-UHFFFAOYSA-N
- CAS Registry Number: 3910-35-8
- Chemical structure:
View 3d structure (requires JavaScript / HTML 5) - Other names: Indan, 1,1,3-trimethyl-3-phenyl-; 1-Phenyl-1,3,3-trimethylindan; 1-Phenyl-1,3,3-trimethylindane; 1,1,3-Trimethyl-3-phenylindan; 1,1,3-Trimethyl-3-phenylindane; 1,3,3-Trimethyl-1-phenylindan; 2,3-Dihydro-1,1,3-trimethyl-3-phenyl-1H-indene; 1,3,3-Trimethyl-1-phenylindane; NSC 11311; NSC 55135; Styrene, alpha-methyl-, dimer

Phase change data

Data compiled by: Thermodynamics Research Center, NIST Boulder Laboratories, Chris Muzny director
Quantity | Value | Units | Method | Reference | Comment |
---|---|---|---|---|---|
Tboil | 582. | K | N/A | Puranene, 1933 | Uncertainty assigned by TRC = 5. K |
Quantity | Value | Units | Method | Reference | Comment |
Tfus | 325. | K | N/A | Welsh and Drake, 1938 | Uncertainty assigned by TRC = 3. K |
Tfus | 326. | K | N/A | Bergmann, 1931 | Uncertainty assigned by TRC = 3. K |

References

Puranene, 1933
Puranene, N.,
Ann. Acad. Sci. Fennicae, 1933, 1933, No. 10, 1. [all data]
Welsh and Drake, 1938
Welsh, L.H.; Drake, N.L.,
The Condensation of Tertiary Aryl Substituted Carbinos with Phenol in the Presence of Aluminum Chloride,
J. Am. Chem. Soc., 1938, 60, 59. [all data]
Bergmann, 1931
Bergmann, E.D.,
Chem. Ber., 1931, 64, 1493. [all data]