3,5,5-trimethyl-2-heptene
- Formula: C10H20
- Molecular weight: 140.2658
- IUPAC Standard InChIKey: DCHMHNYBYHOYQC-RMKNXTFCSA-N
- CAS Registry Number: 39083-40-4
- Chemical structure:
View 3d structure (requires JavaScript / HTML 5) - Species with the same structure:

Phase change data

Data compiled by: Thermodynamics Research Center, NIST Boulder Laboratories, Chris Muzny director
Quantity | Value | Units | Method | Reference | Comment |
---|---|---|---|---|---|
Tboil | 435.3 | K | N/A | Stehman, Cook, et al., 1950 | Uncertainty assigned by TRC = 1. K |
Tboil | 433.5 | K | N/A | Foehr and Fenske, 1949 | Uncertainty assigned by TRC = 2. K |
Tboil | 431. | K | N/A | Mosher, 1940 | Uncertainty assigned by TRC = 4. K |

References

Stehman, Cook, et al., 1950
Stehman, C.J.; Cook, N.C.; Percival, W.C.; Whitmore, F.C.,
Hydrocarbons: XI synthesis of nineteen decenes,
J. Am. Chem. Soc., 1950, 72, 4163-5. [all data]
Foehr and Fenske, 1949
Foehr, E.G.; Fenske, M.R.,
Magneto-optic Rotation of Hydrocarbons,
Ind. Eng. Chem., 1949, 41, 1956. [all data]
Mosher, 1940
Mosher, W.A.,
, Ph.D. Dissertation, Penn. State Univ., Univ. Park, 1940. [all data]