3,4,5,5-tetramethylhex-2-ene
- Formula: C10H20
- Molecular weight: 140.2658
- IUPAC Standard InChIKey: PSSMIMCIKZSQIG-BQYQJAHWSA-N
- CAS Registry Number: 39083-38-0
- Chemical structure:
View 3d structure (requires JavaScript / HTML 5) - Species with the same structure:
- Other names: 3,4,5,5-tetramethyl-2-hexene

Phase change data

Data compiled by: Thermodynamics Research Center, NIST Boulder Laboratories, Chris Muzny director
Quantity | Value | Units | Method | Reference | Comment |
---|---|---|---|---|---|
Tboil | 425.2 | K | N/A | Whitmore, Ropp, et al., 1950 | Uncertainty assigned by TRC = 2. K |
Tboil | 428.6 | K | N/A | Foehr and Fenske, 1949 | Uncertainty assigned by TRC = 1.5 K |
Tboil | 425. | K | N/A | Whitmore and Mosher, 1941 | Uncertainty assigned by TRC = 4. K |
Tboil | 425. | K | N/A | Mosher, 1940 | Uncertainty assigned by TRC = 3. K |

References

Whitmore, Ropp, et al., 1950
Whitmore, F.C.; Ropp, W.S.; Cook, N.C.,
The Dimerization of Triptene with Sulfuric Acid,
J. Am. Chem. Soc., 1950, 72, 1507. [all data]
Foehr and Fenske, 1949
Foehr, E.G.; Fenske, M.R.,
Magneto-optic Rotation of Hydrocarbons,
Ind. Eng. Chem., 1949, 41, 1956. [all data]
Whitmore and Mosher, 1941
Whitmore, F.C.; Mosher, W.A.,
J. Am. Chem. Soc., 1941, 63, 1120. [all data]
Mosher, 1940
Mosher, W.A.,
, Ph.D. Dissertation, Penn. State Univ., Univ. Park, 1940. [all data]