4H-Pyrido[1,2-a]pyrimidin-4-one, 3,6-dimethyl-
- Formula: C10H10N2O
- Molecular weight: 174.1992
- IUPAC Standard InChIKey: VNZAABOALQMGKL-UHFFFAOYSA-N
- CAS Registry Number: 39080-46-1
- Chemical structure:
View 3d structure (requires JavaScript / HTML 5) - Other names: 3,6-Dimethyl-4H-pyrido[1,2-a]pyrimidin-4-one; 3,6-Dimethyl-4H-pyrid-[1,2-a]-pyrimidin-4-one

Kovats' RI, non-polar column, isothermal

Column type | Active phase | Temperature (C) | I | Reference | Comment |
---|---|---|---|---|---|
Packed | OV-1 | 240. | 1694. | Papp, Józan, et al., 1987 | N2, Gas Chrom Q (100-120 mesh); Column length: 1.8 m |

Normal alkane RI, polar column, temperature ramp

Column type | Active phase | I | Reference | Comment |
---|---|---|---|---|
Capillary | FFAP | 2144. | Nebesny, Budryn, et al., 2007 | 30. m/0.32 mm/0.5 μm, N2, 35. C @ 5. min, 4. K/min, 320. C @ 45. min |

References

Papp, Józan, et al., 1987
Papp, O.; Józan, M.; Szász, Gy.; Hermecz, I.,
Correlation Between Molar Refraction and Gas Chromatographic Retention Data,
J. Chromatogr., 1987, 403, 11-18, https://doi.org/10.1016/S0021-9673(00)96336-2
. [all data]
Nebesny, Budryn, et al., 2007
Nebesny, E.; Budryn, G.; Kula, J.; Majda, T.,
The effect of roasting method on headspace composition of robusta coffee bean aroma,
Eur. Food Res. Technol., 2007, 225, 1, 9-19, https://doi.org/10.1007/s00217-006-0375-0
. [all data]