Naphthalene, 1,2,3,4,4a,5,6,8a-octahydro-7-methyl-4-methylene-1-(1-methylethyl)-, (1α,4aβ,8aα)-

Van Den Dool and Kratz RI, non-polar column, custom temperature program

Data compiled by: NIST Mass Spectrometry Data Center, William E. Wallace, director

Column type CapillaryCapillaryCapillaryCapillaryCapillary
Active phase DB-5CBP-5BPX-5DB-5MSDB-5
Column length (m) 30.30.30.30.30.
Carrier gas HeHe HeHe
Substrate
Column diameter (mm) 0.250.250.250.250.32
Phase thickness (μm) 0.250.250.250.250.25
Program 40C(2min) => 4C/min => 220C => 20C/min => 280C60C => 3C/min => 246C => 10C/min => 270C (5min)35C(5min) => 3C/min => 210C => 40C/min => 240C (4min)50C(3min) => 200C(2min) => 15C/min => 300C(5min)40C(3min) => 3C/min => 180C => 10C/min => 260C(2min)
I 1515.1515.1520.1543.1469.
ReferenceAndrade, Sampaio, et al., 2007Silva, Oliveira, et al., 2007Cardeal, da Silva, et al., 2006Eom S.H., Yang H.S., et al., 2006Moon, Cliff, et al., 2006
Comment MSDC-RI MSDC-RI MSDC-RI MSDC-RI MSDC-RI
Column type CapillaryCapillaryCapillaryCapillaryCapillary
Active phase DB-5SE-525 % Phenyl methyl siloxaneDB-5MSSPB-1
Column length (m)  25.30.30.50.
Carrier gas  H2HeHe
Substrate
Column diameter (mm)  0.320.320.250.25
Phase thickness (μm)  0.430.150.250.25
Program not specified60C(8min) => 3C/min => 180C => 20C/min => 250C(10min)45C => 1C/min => 100C => 5C/min => 250C (10min)40 (5min) => 4C/min => 140C => 4C/min => 200C (20min)70C(3min) => 4C/min => 120C => 8C/min => 250C
I 1543.1506.1514.1511.1516.
ReferenceÖzel, Gögüs, et al., 2006Lorenzo, Paz, et al., 2005Sacchetti, Maietti, et al., 2005Zheng, Kim, et al., 2005Díaz-Maroto, Sánchez Palomo, et al., 2004
Comment MSDC-RI MSDC-RI MSDC-RI MSDC-RI MSDC-RI
Column type CapillaryCapillaryCapillaryCapillaryCapillary
Active phase SE-52CBP-5HP-5BP-1DB-1
Column length (m) 30.50.50.50.60.
Carrier gas HeHeHe He
Substrate
Column diameter (mm) 0.520.250.20.220.25
Phase thickness (μm) 0.150.250.330.250.25
Program 45C => 1C/min => 100C => 5C/min => 250C (10min)60C(2min) => 3C/min => 240C => 10C/min => 280C(10min)50C(2min) => 5C/min => 150C => 10C/min => 250C(30min)not specified-20C (5min) => 10C/min => 100C => 4C/min => 200C => 10C/min => 280C
I 1515.1507.1511.1507.1479.
ReferenceSacchetti, Medici, et al., 2004Azevedo, Campos, et al., 2002García, Alvarez, et al., 2002Cavalli, Ranarivelo, et al., 2001Eri, Khoo, et al., 2000
Comment MSDC-RI MSDC-RI MSDC-RI MSDC-RI MSDC-RI
Column type CapillaryCapillary
Active phase HP-5SE-52
Column length (m) 30.25.
Carrier gas  He
Substrate
Column diameter (mm) 0.250.25
Phase thickness (μm) 0.250.25
Program 40C(1min) => 3C/min => 120C => 5C/min => 280C60C(8min) => 3C/min => 180C => 20C/min => 230C
I 1512.1510.
ReferenceIsidorov, Krajewska, et al., 2000Lorenzo, Dellacassa, et al., 2000
Comment MSDC-RI MSDC-RI

Kovats' RI, non-polar column, isothermal

Data compiled by: NIST Mass Spectrometry Data Center, William E. Wallace, director

Column type CapillaryCapillaryCapillaryPackedPacked
Active phase SE-30SE-30OV-101SF-96Apiezon L
Column length (m)  40. 7.37.3
Carrier gas     He
Substrate     Silanized support (not indicated)
Column diameter (mm)  0.35  3.17
Phase thickness (μm)  0.35
Temperature (C) 150.100.130.170.155.
I 1497.1496.61501.1524.1555.
ReferenceTudor and Moldovan, 1999Tudor, 1997Clarke, Perry, et al., 1994Andersen, Bissonette, et al., 1977Ohta, Andersen, et al., 1977
Comment MSDC-RI MSDC-RI MSDC-RI MSDC-RI MSDC-RI
Column type CapillaryPacked
Active phase SF-96SE-30
Column length (m)
Carrier gas  He
Substrate  Chromosorb G
Column diameter (mm)
Phase thickness (μm)
Temperature (C) 170.130.
I 1523.51506.5
ReferenceAndersen, Syrdal, et al., 1973Andersen and Falcone, 1969
Comment MSDC-RI MSDC-RI

References

Andrade, Sampaio, et al., 2007
Andrade, M.S.; Sampaio, T.S.; Nogueira, P.C.L.; Ribeiro, A.S.; Bittrich, V.; Amaral, M.C.E., Volatile compounds of the leaves, flowers and fruits of Kielmeyera rugosa Choisy (Clusiaceae), Flavour Fragr. J., 2007, 22, 1, 49-52, https://doi.org/10.1002/ffj.1751 . [all data]

Silva, Oliveira, et al., 2007
Silva, F.G.; Oliveira, C.B.A.; Pinto, J.E.B.P.; Nascimento, V.E.; Santos, S.C.; Seraphin, J.C.; Ferri, P.H., Seasonal Variability in the Essential Oils of Wild and Cultivated Baccharis trimera, J. Braz. Chem. Soc., 2007, 18, 5, 990-997, https://doi.org/10.1590/S0103-50532007000500017 . [all data]

Cardeal, da Silva, et al., 2006
Cardeal, Z.L.; da Silva, M.D.R.G.; Marriott, P.J., Comprehensive two-dimensional gas chromatography/mass spectrometric analysis of pepper volatiles, Rapid Commun. Mass Spectrom., 2006, 20, 19, 2823-2836, https://doi.org/10.1002/rcm.2665 . [all data]

Eom S.H., Yang H.S., et al., 2006
Eom S.H.; Yang H.S.; Weston L.A., An evaluation of the allelopathic potential of selected perennial groundcovers: Foliar volatiles of catmint (Nepeta x faassenii) inhibit seedling growth, J. Chem. Ecol., 2006, 32, 8, 1835-1848, https://doi.org/10.1007/s10886-006-9112-1 . [all data]

Moon, Cliff, et al., 2006
Moon, S.-Y.; Cliff, M.A.; Li-Chan, E.C.Y., Odour-active components of simulated beef flavour analysed by solid phase microextraction and gas chromatography-mass spectrometry and -olfactometry, Food Res. Int., 2006, 39, 3, 294-308, https://doi.org/10.1016/j.foodres.2005.08.002 . [all data]

Özel, Gögüs, et al., 2006
Özel, M.Z.; Gögüs, F.; Lewis, A.C., Determination of Teucrium chamaedrys volatiles by using direct thermal desorption-comprehensive two-dimensional gas chromatography-time-of-flight mass spectrometry, J. Chromatogr. A, 2006, 1114, 1, 164-169, https://doi.org/10.1016/j.chroma.2006.02.036 . [all data]

Lorenzo, Paz, et al., 2005
Lorenzo, D.; Paz, D.; Davies, P.; Villamil, J.; Vila, R.; Canigueral, S.; Dellacassa, E., Application of Multidimensional Gas Chromatography to the Enantioselective Characterisation of the Essential Oil of Eupatorium buniifolium Hooker et Arnott, Phytochem. Anal., 2005, 16, 1, 39-44, https://doi.org/10.1002/pca.808 . [all data]

Sacchetti, Maietti, et al., 2005
Sacchetti, G.; Maietti, S.; Muzzoli, M.; Scaglianti, M.; Manfredini, S.; Radice, M.; Bruni, R., Comparative evaluation of 11 essential oils of different origin as functional antioxidants, antiradicals and antimicrobials in foods, Food Chem., 2005, 91, 4, 621-632, https://doi.org/10.1016/j.foodchem.2004.06.031 . [all data]

Zheng, Kim, et al., 2005
Zheng, C.H.; Kim, K.H.; Kim, T.H.; Lee, H.J., Analysis and characterization of aroma-active compounds of Schizandra chinensis (omija) leaves, J. Sci. Food Agric., 2005, 85, 1, 161-166, https://doi.org/10.1002/jsfa.1975 . [all data]

Díaz-Maroto, Sánchez Palomo, et al., 2004
Díaz-Maroto, M.C.; Sánchez Palomo, E.; Castro, L.; González Viñas, M.A.; Pérez-Coello, M.S., Changes produced in the aroma compounds and structural integrity of basil (Ocimum basilicum L) during drying, J. Sci. Food Agric., 2004, 84, 15, 2070-2076, https://doi.org/10.1002/jsfa.1921 . [all data]

Sacchetti, Medici, et al., 2004
Sacchetti, G.; Medici, A.; Maietti, S.; Radice, M.; Muzzoli, M.; Manfredini, S.; Braccioli, E.; Bruni, R., Composition and functional properties of the essential oil of Amazonian basil, Ocimum micranthum Willd., Labiatae in comparison with commercial essential oils, J. Agric. Food Chem., 2004, 52, 11, 3486-3491, https://doi.org/10.1021/jf035145e . [all data]

Azevedo, Campos, et al., 2002
Azevedo, N.R.; Campos, I.F.P.; Ferreira, H.D.; Portes, T.A.; Seraphin, J.C.; de Paula, J.R.; Santos, S.C.; Ferri, P.H., Essential oil chemotypes in Hyptis suaveolens from Brazilian Cerrado, Biochem. Syst. Ecol., 2002, 30, 3, 205-216, https://doi.org/10.1016/S0305-1978(01)00075-8 . [all data]

García, Alvarez, et al., 2002
García, D.; Alvarez, A.; Tornos, P.; Fernandez, A.; Sáenz, T., Gas chromatographic-mass spectrometry study of the essential oils of Pimenta racemosa var. terebinthina and P. racemosa var. grisea, Z. Naturforsch., 2002, 57c, 449-451. [all data]

Cavalli, Ranarivelo, et al., 2001
Cavalli, J.-F.; Ranarivelo, L.; Ratsimbason, M.; Bernardini, A.-F.; Casanova, J., Constituents of the essential oil of six Helichrysum species from Madagascar, Flavour Fragr. J., 2001, 16, 4, 253-256, https://doi.org/10.1002/ffj.994 . [all data]

Eri, Khoo, et al., 2000
Eri, S.; Khoo, B.K.; Lech, J.; Hartman, T.G., Direct thermal desorption-gas chromatography and gas chromatography-mass spectrometry profiling of hop (Humulus lupulus L.) essential oils in support of varietal characterization, J. Agric. Food Chem., 2000, 48, 4, 1140-1149, https://doi.org/10.1021/jf9911850 . [all data]

Isidorov, Krajewska, et al., 2000
Isidorov, V.; Krajewska, U.; Bal, K.; Jaroszynska, J.; Niesluchowska, A.; Fuksman, I., GC-MS identification of multicomponent organic compounds mixtures using extra column phase equilibrium, Chem. Anal. (Warsaw), 2000, 45, 513-520. [all data]

Lorenzo, Dellacassa, et al., 2000
Lorenzo, D.; Dellacassa, E.; Atti-Serafini, L.; Santos, A.C.; Frizzo, C.; Paroul, N.; Moyna, P.; Mondello, L.; Dugo, G., Composition and stereoanalysis of Cymbopogon winterianus Jowitt oil from Southern Brazil, Flavour Fragr. J., 2000, 15, 3, 177-181, https://doi.org/10.1002/1099-1026(200005/06)15:3<177::AID-FFJ887>3.0.CO;2-M . [all data]