Cyclohexanol, 1-methyl-4-(1-methylethyl)-, cis-
- Formula: C10H20O
- Molecular weight: 156.2652
- IUPAC Standard InChIKey: CMLYGGFIXXLYQT-AOOOYVTPSA-N
- CAS Registry Number: 3901-95-9
- Chemical structure:
View 3d structure (requires JavaScript / HTML 5) - Stereoisomers:
- Other names: cis-β-Dihydroterpineol; cis-1-p-Menthanol; p-Menthan-1-ol, cis; 4-Isopropyl-1-methylcyclohexanol, (Z)-; cis-p-Menthan-1-ol

Van Den Dool and Kratz RI, non-polar column, temperature ramp

Column type | Active phase | I | Reference | Comment |
---|---|---|---|---|
Capillary | SE-54 | 1138. | Simionatto, Porto, et al., 2005 | 25. m/0.25 mm/0.2 μm, H2, 4. K/min; Tstart: 50. C; Tend: 250. C |

Normal alkane RI, non-polar column, custom temperature program

Column type | Active phase | I | Reference | Comment |
---|---|---|---|---|
Capillary | SE-30 | 1132. | Vinogradov, 2004 | Program: not specified |
Capillary | Polydimethyl siloxanes | 1132. | Zenkevich, 1997 | Program: not specified |

References

Simionatto, Porto, et al., 2005
Simionatto, E.; Porto, C.; da Silva, U.F.; Squizani, A.; Dalcol, I.I.; Morel, A.F.,
Composition and antimicrobial activity of the essential oil from Aloysia sellowii,
J. Braz. Chem. Soc., 2005, 16, 6B, 1458-1462, https://doi.org/10.1590/S0103-50532005000800028
. [all data]
Vinogradov, 2004
Vinogradov, B.A.,
Production, composition, properties and application of essential oils, 2004, retrieved from http://viness.narod.ru. [all data]
Zenkevich, 1997
Zenkevich, I.G.,
Analytical Parameters of Components of Essential Oils for their Chromatographic and Chromato-Spectral Identificaiton. Oxsigenated derivatives of Mono- and Sesquiterpene Hydrocarbons,
Rastit, Resursy (Rus.), 1997, 33, 1, 16-28. [all data]