Cyclohexanol, 1-methyl-4-(1-methylethyl)-, trans-
- Formula: C10H20O
- Molecular weight: 156.2652
- IUPAC Standard InChIKey: CMLYGGFIXXLYQT-MGCOHNPYSA-N
- CAS Registry Number: 3901-93-7
- Chemical structure:
View 3d structure (requires JavaScript / HTML 5) - Stereoisomers:
- Other names: p-Menthan-1-ol, trans-; trans-1-Hydroxy-p-menthane; trans-β-Dihydroterpineol; trans-1-p-Menthanol; trans-Dihydro-β-terpineol; trans-p-Mentan-1-ol; 4-Isopropyl-1-methylcyclohexanol, (E)-; trans-p-Menth-1-ol

Kovats' RI, non-polar column, isothermal

Column type | Active phase | Temperature (C) | I | Reference | Comment |
---|---|---|---|---|---|
Packed | Apiezon L | 130. | 1167. | Paris and Alexandre, 1972 | Chromosorb W AW |

Normal alkane RI, non-polar column, custom temperature program

Column type | Active phase | I | Reference | Comment |
---|---|---|---|---|
Capillary | SE-30 | 1155. | Vinogradov, 2004 | Program: not specified |
Capillary | Polydimethyl siloxanes | 1155. | Zenkevich, 1997 | Program: not specified |

References

Paris and Alexandre, 1972
Paris, C.; Alexandre, P.,
Stereochemical Investigation of Cyclohexane and Terpene Compounds by Gas Chromatography,
J. Chromatogr. Sci., 1972, 10, 6, 402-411, https://doi.org/10.1093/chromsci/10.6.402
. [all data]
Vinogradov, 2004
Vinogradov, B.A.,
Production, composition, properties and application of essential oils, 2004, retrieved from http://viness.narod.ru. [all data]
Zenkevich, 1997
Zenkevich, I.G.,
Analytical Parameters of Components of Essential Oils for their Chromatographic and Chromato-Spectral Identificaiton. Oxsigenated derivatives of Mono- and Sesquiterpene Hydrocarbons,
Rastit, Resursy (Rus.), 1997, 33, 1, 16-28. [all data]