2-Propenoic acid, 3-(4-methoxyphenyl)-, methyl ester, (E)-
- Formula: C11H12O3
- Molecular weight: 192.2112
- IUPAC Standard InChIKey: VEZIKIAGFYZTCI-VMPITWQZSA-N
- CAS Registry Number: 3901-07-3
- Chemical structure:
View 3d structure (requires JavaScript / HTML 5) - Species with the same structure:
- Stereoisomers:
- Other names: (E)-Methyl-p-methoxycinnamate; Methyl (E)-p-methoxycinnamate; p-Coumaric acid, methyl ether, methyl ester, trans-; p-Coumaric acid, methyl ether, methyl ester; Methyl (2E)-3-(4-methoxyphenyl)-2-propenoate

Van Den Dool and Kratz RI, non-polar column, custom temperature program

Column type | Active phase | I | Reference | Comment |
---|---|---|---|---|
Capillary | VF-5MS | 1768.1 | Tret'yakov, 2008 | 30. m/0.25 mm/0.25 μm, He; Program: Multi-step temperature program; T(initial)=60C; T(final)=270C |

References

Tret'yakov, 2008
Tret'yakov, K.V.,
Retention Data. NIST Mass Spectrometry Data Center., NIST Mass Spectrometry Data Center, 2008. [all data]