Dibenzofuran, octachloro-
- Formula: C12Cl8O
- Molecular weight: 443.752
- IUPAC Standard InChIKey: RHIROFAGUQOFLU-UHFFFAOYSA-N
- CAS Registry Number: 39001-02-0
- Chemical structure:
View 3d structure (requires JavaScript / HTML 5) - Other names: Octachlorodibenzofuran; Perchlorodibenzofuran; 1,2,3,4,6,7,8,9-Octachlorodibenzo[b,d]furan; 1,2,3,4,6,7,8,9-Octachlorodibenzofuran; Octapolychlorinated dibenzofuran

Phase change data

Data compiled by: William E. Acree, Jr., James S. Chickos
Enthalpy of sublimation
ΔsubH (kJ/mol) | Temperature (K) | Method | Reference | Comment |
---|---|---|---|---|
141.7 ± 1.8 | 455. | ME | Li, Shibata, et al., 2004 | Based on data from 438. to 473. K. |
149.4 | 423. | T | Rordorf, 1989 | Based on data from 373. to 474. K. See also Rordorf, 1986. |

Van Den Dool and Kratz RI, non-polar column, custom temperature program

Data compiled by: NIST Mass Spectrometry Data Center, William E. Wallace, director

Column type Capillary
Active phase HP-5
Column length (m) 25.
Carrier gas He
Substrate
Column diameter (mm) 0.20
Phase thickness (μm) 0.11
Program 100 0C (1 min) 20 0C/min -> 180 0C 5 0C/min -> 290 0C (until elution of the last peak)
I 3152.
ReferenceKorhonen and Mantykoski, 1989
Comment MSDC-RI

References

Li, Shibata, et al., 2004
Li, Xian-Wei; Shibata, Etsuro; Kasai, Eiki; Nakamura, Takashi,
VAPOR PRESSURES AND ENTHALPIES OF SUBLIMATION OF 17 POLYCHLORINATED DIBENZO-p-DIOXINS AND FIVE POLYCHLORINATED DIBENZOFURANS,
Environ Toxicol Chem, 2004, 23, 2, 348-808, https://doi.org/10.1897/03-193
. [all data]
Rordorf, 1989
Rordorf, Berchtold F.,
Prediction of vapor pressures, boiling points and enthalpies of fusion for twenty-nine halogenated dibenzo-p-dioxins and fifty-five dibenzofurans by a vapor pressure correlation method,
Chemosphere, 1989, 18, 1-6, 783-788, https://doi.org/10.1016/0045-6535(89)90196-3
. [all data]
Rordorf, 1986
Rordorf, Berchtold F.,
Thermal properties of dioxins, furans and related compounds,
Chemosphere, 1986, 15, 9-12, 1325-1332, https://doi.org/10.1016/0045-6535(86)90407-8
. [all data]