Dodecane, 2,6,10-trimethyl-
- Formula: C15H32
- Molecular weight: 212.4146
- IUPAC Standard InChIKey: YFHFHLSMISYUAQ-UHFFFAOYSA-N
- CAS Registry Number: 3891-98-3
- Chemical structure:
View 3d structure (requires JavaScript / HTML 5) - Other names: Farnesan; Farnesane; 2,6,10-Trimethyldodecane

Phase change data

Data compiled by: Thermodynamics Research Center, NIST Boulder Laboratories, Chris Muzny director
Quantity | Value | Units | Method | Reference | Comment |
---|---|---|---|---|---|
Tboil | 525.1 | K | N/A | Anonymous, 1962 | Uncertainty assigned by TRC = 0.5 K |

Normal alkane RI, non-polar column, custom temperature program

Data compiled by: NIST Mass Spectrometry Data Center, William E. Wallace, director

Column type CapillaryCapillaryCapillaryCapillary
Active phase HP-5 MSSqualaneOV-1, SE-30, Methyl silicone, SP-2100, OV-101, DB-1, etc.Apiezon L
Column length (m) 30. 50.
Carrier gas Helium Hydrogen
Substrate
Column diameter (mm) 0.25 0.32
Phase thickness (μm) 0.25
Program not specifiednot specifiednot specifiednot specified
I 1382.1368.1379.1358.
ReferenceKotowska, Zalikowski, et al., 2012Petrov, 1984Waggott and Davies, 1984Douglas, Blumer, et al., 1971
Comment MSDC-RI MSDC-RI MSDC-RI MSDC-RI

Normal alkane RI, non-polar column, temperature ramp

Data compiled by: NIST Mass Spectrometry Data Center, William E. Wallace, director

Column type CapillaryCapillaryCapillaryCapillaryCapillary
Active phase HP-5 MSHP-5 MSSPB-5HP-5 MSVF-5MS
Column length (m) 30.30.60.30.30.
Carrier gas Helium  Helium
Substrate
Column diameter (mm) 0.250.250.320.250.25
Phase thickness (μm) 0.250.251.000.250.25
Tstart (C) 35.60.40.60.40.
Tend (C) 300.300.230.300.250.
Heat rate (K/min) 3.15.3.15.7.
Initial hold (min) 5.2.5.2.
Final hold (min) 15.10.10.10.
I 1376.1379.1378.1379.1365.
ReferenceKotowska, Zalikowski, et al., 2012Xu, Han, et al., 2012Sivadier, Ratel, et al., 2009Xu, Han, et al., 2009Ghiasvand, Setkova, et al., 2007
Comment MSDC-RI MSDC-RI MSDC-RI MSDC-RI MSDC-RI
Column type CapillaryCapillary
Active phase HP-5Apieson L
Column length (m) 30.50.
Carrier gas HeHe
Substrate  Gas-Chrom Q
Column diameter (mm) 0.320.25
Phase thickness (μm) 0.25
Tstart (C) 60.120.
Tend (C) 260.280.
Heat rate (K/min) 5.6.
Initial hold (min) 2.
Final hold (min) 14.
I 1378.1365.
ReferenceYayli, Gülec, et al., 2006Albaigès, Borbón, et al., 1981
Comment MSDC-RI MSDC-RI

References

Anonymous, 1962
Anonymous, R.,
, Am. Pet. Inst. Res. Proj. 58A, Annu. Rep., 1962. [all data]