cis-p-Mentha-2,8-dien-1-ol
- Formula: C10H16O
- Molecular weight: 152.2334
- IUPAC Standard InChIKey: MKPMHJQMNACGDI-NXEZZACHSA-N
- CAS Registry Number: 3886-78-0
- Chemical structure:
View 3d structure (requires JavaScript / HTML 5) - Stereoisomers:
- Other names: 2-Cyclohexen-1-ol, 1-methyl-4-(1-methylethenyl)-, cis-; Mentha-2,8-dien-1-ol, para, cis-; p-Menth-2,8-dien-1-ol, cis-; p-Mentha-2,8-dien-1-ol, cis-; cis-p-Mentha-2,8-diene-1-ol; 4-Isopropenyl-1-methyl-2-cyclohexen-1-ol-, cis; 1-Methyl-4-(1-methylethenyl)-2-cyclohexen-1-ol, cis-; (Z)-p-Mentha-2,8-dien-1-ol; cis-2-p-menthene-1-ol

Van Den Dool and Kratz RI, non-polar column, temperature ramp

Column type | Active phase | I | Reference | Comment |
---|---|---|---|---|
Capillary | CP Sil 5 CB | 1100. | Pino, Marbot, et al., 2002 | 25. m/0.25 mm/0.25 μm, N2, 60. C @ 6. min, 4. K/min; Tend: 280. C |
Capillary | CP Sil 5 CB | 1104. | Pino, Marbot, et al., 2001 | 50. m/0.32 mm/0.4 μm, He, 60. C @ 10. min, 3. K/min, 280. C @ 60. min |

References

Pino, Marbot, et al., 2002
Pino, J.A.; Marbot, R.; Quert, R.; García, H.,
Study of essential oils of Eucalyptus resinifera Smith, E. tereticornis Smith and Corymbia maculata (Hook.) K.D. Hill L.A.S. Johnson, grown in Cuba,
Flavour Fragr. J., 2002, 17, 1, 1-4, https://doi.org/10.1002/ffj.1026
. [all data]
Pino, Marbot, et al., 2001
Pino, J.A.; Marbot, R.; Vázquez, C.,
Characterization of volatiles in strawberry guava (Psidium cattleianum Sabine) fruit,
J. Agric. Food Chem., 2001, 49, 12, 5883-5887, https://doi.org/10.1021/jf010414r
. [all data]