Benzenemethanamine, α-methyl-, (R)-
- Formula: C8H11N
- Molecular weight: 121.1796
- IUPAC Standard InChIKey: RQEUFEKYXDPUSK-ZETCQYMHSA-N
- CAS Registry Number: 3886-69-9
- Chemical structure:
View 3d structure (requires JavaScript / HTML 5) - Stereoisomers:
- Other names: (R)-α-Methylbenzenemethanamine; D-α-methylbenzylamine

Phase change data

Data compiled as indicated in comments:
BS - Robert L. Brown and Stephen E. Stein
AC - William E. Acree, Jr., James S. Chickos
Quantity | Value | Units | Method | Reference | Comment |
---|---|---|---|---|---|
Tboil | 460.2 | K | N/A | Weast and Grasselli, 1989 | BS |
Quantity | Value | Units | Method | Reference | Comment |
ΔvapH° | 54.1 ± 0.1 | kJ/mol | C | Atik, Saito, et al., 1987 | AC |
Reduced pressure boiling point
Tboil (K) | Pressure (bar) | Reference | Comment |
---|---|---|---|
453.7 | 1.02 | Aldrich Chemical Company Inc., 1990 | BS |

References

Weast and Grasselli, 1989
CRC Handbook of Data on Organic Compounds, 2nd Editon, Weast,R.C and Grasselli, J.G., ed(s)., CRC Press, Inc., Boca Raton, FL, 1989, 1. [all data]
Atik, Saito, et al., 1987
Atik, Zadjia; Saito, Yoshihiro; Kusano, Kazuhito,
Thermodynamic properties of liquid enantiomers I. Enthalpies of vaporization of fenchones, α-methylbenzylamines, and limonenes at 298.15 K,
The Journal of Chemical Thermodynamics, 1987, 19, 1, 99-102, https://doi.org/10.1016/0021-9614(87)90167-4
. [all data]
Aldrich Chemical Company Inc., 1990
Aldrich Chemical Company Inc.,
Catalog Handbook of Fine Chemicals, Aldrich Chemical Company, Inc., Milwaukee WI, 1990, 1. [all data]