4'-(2-Methylpropyl)acetophenone
- Formula: C12H16O
- Molecular weight: 176.2548
- IUPAC Standard InChIKey: KEAGRYYGYWZVPC-UHFFFAOYSA-N
- CAS Registry Number: 38861-78-8
- Chemical structure:
View 3d structure (requires JavaScript / HTML 5) - Other names: p-iso-Butylacetophenone; 4-Isobutylacetophenone; Ethanone, 1-[4-(2-methylpropyl)phenyl]-; Acetophenone, 4-isobutyl-; 4'-Isobutylacetophenone; 1-(4-Isobutylphenyl)-1-ethanone (or 4-isobutylacetophenone); 1-[4-(2-methylpropyl)phenyl]ethan-1-one

Phase change data

Data compiled by: Robert L. Brown and Stephen E. Stein
Reduced pressure boiling point
Tboil (K) | Pressure (bar) | Reference |
---|---|---|
407. to 408. | 0.021 | Frinton Laboratories Inc., 1986 |

Van Den Dool and Kratz RI, non-polar column, temperature ramp

Column type | Active phase | I | Reference | Comment |
---|---|---|---|---|
Capillary | HP-1 | 1411. | Caviglioli, Valeria, et al., 2002 | 25. m/0.2 mm/0.3 μm, 40. C @ 0.2 min, 15. K/min, 250. C @ 5. min |

References

Frinton Laboratories Inc., 1986
Frinton Laboratories Inc.,
Catalog Number 11, Frinton Laboratories Inc., Vineland, NJ, 1986, 99. [all data]
Caviglioli, Valeria, et al., 2002
Caviglioli, G.; Valeria, P.; Brunella, P.; Sergio, C.; Attilia, A.; Gaetano, B.,
Identification of degradation products of Ibuprofen arising from oxidative and thermal treatments,
J. Pharm. Biomed. Anal., 2002, 30, 3, 499-509, https://doi.org/10.1016/S0731-7085(02)00400-4
. [all data]