1-Butyltetralin
- Formula: C14H20
- Molecular weight: 188.3086
- IUPAC Standard InChIKey: GCKPJUYBKVPDAU-UHFFFAOYSA-N
- CAS Registry Number: 38857-76-0
- Chemical structure:
View 3d structure (requires JavaScript / HTML 5) - Other names: Tetraline, 1-butyl; 1-Butyl-1,2,3,4-tetrahydronaphthalene

Condensed phase thermochemistry data

Data compiled by: Hussein Y. Afeefy, Joel F. Liebman, and Stephen E. Stein
Quantity | Value | Units | Method | Reference | Comment |
---|---|---|---|---|---|
ΔcH°liquid | -8222.4 | kJ/mol | Ccb | Karo, McLaughlin, et al., 1953 | Corrected from net heat of combustion; Corresponding ΔfHºliquid = -145. kJ/mol (simple calculation by NIST; no Washburn corrections) |

Phase change data

Data compiled by: Thermodynamics Research Center, NIST Boulder Laboratories, Chris Muzny director
Quantity | Value | Units | Method | Reference | Comment |
---|---|---|---|---|---|
Tboil | 546.21 | K | N/A | Hipsher and Wise, 1954 | Uncertainty assigned by TRC = 0.4 K |
Tboil | 546.15 | K | N/A | Karo, McLaughlin, et al., 1953, 2 | Uncertainty assigned by TRC = 0.15 K |

Van Den Dool and Kratz RI, non-polar column, temperature ramp

Column type | Active phase | I | Reference | Comment |
---|---|---|---|---|
Capillary | Ultra-1 | 1489.19 | Haynes and Pitzer, 1985 | 50. m/0.22 mm/0.33 μm, He, 1. K/min; Tstart: -30. C; Tend: 240. C |
Capillary | Ultra-1 | 1497.72 | Haynes and Pitzer, 1985 | 50. m/0.22 mm/0.33 μm, He, 2. K/min; Tstart: -30. C; Tend: 240. C |
Capillary | Ultra-1 | 1503.26 | Haynes and Pitzer, 1985 | 50. m/0.22 mm/0.33 μm, He, 3. K/min; Tstart: -30. C; Tend: 240. C |
Capillary | Ultra-2 | 1517.57 | Haynes and Pitzer, 1985 | 50. m/0.22 mm/0.33 μm, He, 1. K/min; Tstart: -30. C; Tend: 240. C |
Capillary | Ultra-2 | 1527.06 | Haynes and Pitzer, 1985 | 50. m/0.22 mm/0.33 μm, He, 2. K/min; Tstart: -30. C; Tend: 240. C |
Capillary | Ultra-2 | 1533.35 | Haynes and Pitzer, 1985 | 50. m/0.22 mm/0.33 μm, He, 3. K/min; Tstart: -30. C; Tend: 240. C |

Normal alkane RI, non-polar column, isothermal

Column type | Active phase | Temperature (C) | I | Reference | Comment |
---|---|---|---|---|---|
Packed | Polydimethyl siloxane | 147. | 1496. | Ferrand, 1962 |

References

Karo, McLaughlin, et al., 1953
Karo, W.; McLaughlin, R.L.; Hipsher, H.F.,
Dicyclic hydrocarbons. VI. 1,2,3,4-Tetrahydronaphthalene and 1-alkyl-1,2,3,4-tetrahydronaphthalenes,
J. Am. Chem. Soc., 1953, 75, 3233-3235. [all data]
Hipsher and Wise, 1954
Hipsher, H.F.; Wise, P.H.,
Dicyclic Hydrocarbons VIII. 1-Alkylnaphthalenes and Some of Their Tetrahydro Derivatives,
J. Am. Chem. Soc., 1954, 76, 1747-8. [all data]
Karo, McLaughlin, et al., 1953, 2
Karo, W.; McLaughlin, R.L.; Hipsher, H.F.,
Dicyclic Hydrocarbons VI. 1,2,3,5-tetrahydronaphthalene and 1-Alkyl-1,2,3, 4-tetrahydronaphthalenes,
J. Am. Chem. Soc., 1953, 75, 3233. [all data]
Kusakov, et al., 1963
Kusakov, M.M., et al.,
Ultraviolet Absorption Spectra of Aromatic Hydrocarbons, 1963, 165. [all data]
Haynes and Pitzer, 1985
Haynes, P.C., Jr.; Pitzer, E.W.,
Disengaging solutes in shale- and petroleum-derived jet fuels by altering GC programmed temperature rates,
J. Hi. Res. Chromatogr. Chromatogr. Comm., 1985, 8, 5, 230-242, https://doi.org/10.1002/jhrc.1240080504
. [all data]
Ferrand, 1962
Ferrand, R.,
Gas phase chromatography using retention indices for the analysis of tars and their hydrogenation products,
Journees internationales d'etude des methodes de separation immediate at de chromatographie; Org. sur l'initiative du IX., 1962, 132-140. [all data]