o-(1,1,3,3-tetramethylbutyl)phenol
- Formula: C14H22O
- Molecular weight: 206.3239
- IUPAC Standard InChIKey: XSXWOBXNYNULJG-UHFFFAOYSA-N
- CAS Registry Number: 3884-95-5
- Chemical structure:
View 3d structure (requires JavaScript / HTML 5) - Other names: Phenol, 2-(1,1,3,3-tetramethylbutyl)-

Reaction thermochemistry data

Data compiled by: Hussein Y. Afeefy, Joel F. Liebman, and Stephen E. Stein
Individual Reactions
By formula: C14H22O = C14H22O
Quantity | Value | Units | Method | Reference | Comment |
---|---|---|---|---|---|
ΔrH° | -14.2 ± 1.6 | kJ/mol | Eqk | Nesterova, Verevkin, et al., 1985 | liquid phase |

References

Nesterova, Verevkin, et al., 1985
Nesterova, T.N.; Verevkin, S.P.; Malova, T.N.; Pilshchikov, V.A.,
Study of an equilibrium of tert-alkylphenols (thermodynamic analysis of the alkylation of phenols by branched olefins),
Zh. Prikl. Khim. (Leningrad), 1985, 58, 827-833. [all data]