2,2-dimethyl-1,1-diphenylpropane
- Formula: C17H20
- Molecular weight: 224.3407
- IUPAC Standard InChIKey: JJQUOWCQKWDHNZ-UHFFFAOYSA-N
- CAS Registry Number: 38842-11-4
- Chemical structure:
View 3d structure (requires JavaScript / HTML 5) - Permanent link for this species. Use this link for bookmarking this species for future reference.

Phase change data

Data compiled by: Thermodynamics Research Center, NIST Boulder Laboratories, Chris Muzny director
Quantity | Value | Units | Method | Reference | Comment |
---|---|---|---|---|---|
Tfus | 328.15 | K | N/A | Pines and Mark, 1956 | Uncertainty assigned by TRC = 2. K |
Tfus | 329. | K | N/A | Rogers, Brown, et al., 1953 | Uncertainty assigned by TRC = 4. K |

References

Pines and Mark, 1956
Pines, H.; Mark, V.,
Carbanions Additions in the Reaction of Aromatic Hydrocarbons with Monoolefins,
J. Am. Chem. Soc., 1956, 78, 4316. [all data]
Rogers, Brown, et al., 1953
Rogers, E.F.; Brown, H.D.; Rasmussen, I.M.; Heal, R.E.,
J. Am. Chem. Soc., 1953, 75, 2991. [all data]