Triphenylphosphine sulfide
- Formula: C18H15PS
- Molecular weight: 294.350
- IUPAC Standard InChIKey: VYNGFCUGSYEOOZ-UHFFFAOYSA-N
- CAS Registry Number: 3878-45-3
- Chemical structure:
View 3d structure (requires JavaScript / HTML 5) - Other names: Phosphine sulfide, triphenyl-; (C6H5)3P=S; Triphenylphosphorus sulfide; (C6H5)3PS; triphenylphosphine sulphide

Phase change data

Data compiled by: William E. Acree, Jr., James S. Chickos
Quantity | Value | Units | Method | Reference | Comment |
---|---|---|---|---|---|
ΔsubH° | 142.8 ± 6.8 | kJ/mol | N/A | Kirklin, Chickos, et al., 1996 |
Enthalpy of sublimation
ΔsubH (kJ/mol) | Temperature (K) | Method | Reference | Comment |
---|---|---|---|---|
136.8 ± 6.1 | 403. | HSA | Kirklin, Chickos, et al., 1996 | Based on data from 388. to 419. K. |

Gas phase ion energetics data

Data evaluated by: Edward P. Hunter and Sharon G. Lias
Quantity | Value | Units | Method | Reference | Comment |
---|---|---|---|---|---|
Proton affinity (review) | 906.2 | kJ/mol | N/A | Hunter and Lias, 1998 | |
Quantity | Value | Units | Method | Reference | Comment |
Gas basicity | 876.4 | kJ/mol | N/A | Hunter and Lias, 1998 |

References

Kirklin, Chickos, et al., 1996
Kirklin, Duane R.; Chickos, James S.; Liebman, Joel F.,
Enthalpy of formation of triphenylphosphine sulfide,
Struct Chem, 1996, 7, 5-6, 355-361, https://doi.org/10.1007/BF02275161
. [all data]
Hunter and Lias, 1998
Hunter, E.P.; Lias, S.G.,
Evaluated Gas Phase Basicities and Proton Affinities of Molecules: An Update,
J. Phys. Chem. Ref. Data, 1998, 27, 3, 413-656, https://doi.org/10.1063/1.556018
. [all data]