Naphthalene, 1,2,3,4-tetrahydro-2-methyl-
- Formula: C11H14
- Molecular weight: 146.2289
- IUPAC Standard InChIKey: WJRGJANWBCPTLH-UHFFFAOYSA-N
- CAS Registry Number: 3877-19-8
- Chemical structure:
View 3d structure (requires JavaScript / HTML 5) - Other names: β-Methyltetralin; 2-Methyltetralin; 2-Methyltetraline; 1,2,3,4-Tetrahydro-2-methylnaphthalene; 2-Methyl-(1,2,3,4-tetrahydronaphthalene); tetrahydro-2-methylnaphthalene

Reaction thermochemistry data

Data compiled by: Hussein Y. Afeefy, Joel F. Liebman, and Stephen E. Stein
Individual Reactions
By formula: C11H14 = C11H14
Quantity | Value | Units | Method | Reference | Comment |
---|---|---|---|---|---|
ΔrH° | -6.3 | kJ/mol | Eqk | Nieuwstad, Klapwijk, et al., 1973 | liquid phase |

Van Den Dool and Kratz RI, polar column, temperature ramp

Column type | Active phase | I | Reference | Comment |
---|---|---|---|---|
Capillary | DB-Wax | 1685. | Selli, Rannou, et al., 2006 | 30. m/0.25 mm/0.5 μm, He, 4. K/min, 260. C @ 5. min; Tstart: 50. C |

Normal alkane RI, non-polar column, isothermal

Column type | Active phase | Temperature (C) | I | Reference | Comment |
---|---|---|---|---|---|
Packed | Polydimethyl siloxane | 147. | 1218. | Ferrand, 1962 |

Normal alkane RI, non-polar column, custom temperature program

Column type | Active phase | I | Reference | Comment |
---|---|---|---|---|
Capillary | Apieson L | 1207. | Vaisberg and Gizitdinova, 1969 | Helium; Column length: 50. m; Column diameter: 0.25 mm; Program: not specified |

References

Nieuwstad, Klapwijk, et al., 1973
Nieuwstad, Th.J.; Klapwijk, P.; Van Bekkum, H.,
Hydrogenation of alkyl-substituted naphthalenes over palladium,
J. Catal., 1973, 29, 404-411. [all data]
Selli, Rannou, et al., 2006
Selli, S.; Rannou, C.; Prost, C.; Robin, J.; Serot, T.,
Characterization of Aroma-Active Compounds in Rainbow Trout (Oncorhynchus mykiss) Eliciting an Off-Odor,
J. Agric. Food Chem., 2006, 54, 25, 9496-9502, https://doi.org/10.1021/jf0619582
. [all data]
Ferrand, 1962
Ferrand, R.,
Gas phase chromatography using retention indices for the analysis of tars and their hydrogenation products,
Journees internationales d'etude des methodes de separation immediate at de chromatographie; Org. sur l'initiative du IX., 1962, 132-140. [all data]
Vaisberg and Gizitdinova, 1969
Vaisberg, K.M.; Gizitdinova, V.G.,
Gas chromatographic investigation of tetralin and its homologues C11-C12,
Neftekhimia (Rus), 1969, 9, 3, 482-486. [all data]