Cyclopentane, (1,1-dimethylethyl)-
- Formula: C9H18
- Molecular weight: 126.2392
- IUPAC Standard InChIKey: BFWVYBVSRYIDHI-UHFFFAOYSA-N
- CAS Registry Number: 3875-52-3
- Chemical structure:
View 3d structure (requires JavaScript / HTML 5) - Other names: tert-Butylcyclopentane

Phase change data

Data compiled by: Thermodynamics Research Center, NIST Boulder Laboratories, Chris Muzny director
Quantity | Value | Units | Method | Reference | Comment |
---|---|---|---|---|---|
Tboil | 417.95 | K | N/A | Boord, Greenlee, et al., 1946 | Uncertainty assigned by TRC = 0.2 K |
Tboil | 418.1 | K | N/A | Crane, Boord, et al., 1945 | Uncertainty assigned by TRC = 1. K |
Tboil | 417.99 | K | N/A | Boord, Perilstein, et al., 1944 | Uncertainty assigned by TRC = 0.2 K |
Tboil | 418.4 | K | N/A | Pines and Ipatieff, 1939 | Uncertainty assigned by TRC = 1. K |
Quantity | Value | Units | Method | Reference | Comment |
Tfus | 177.1 ± 0.2 | K | AVG | N/A | Average of 8 values; Individual data points |

Kovats' RI, non-polar column, isothermal

Column type | Active phase | Temperature (C) | I | Reference | Comment |
---|---|---|---|---|---|
Capillary | Squalane | 50. | 877.5 | Lunskii and Paizanskaya, 1988 | He; Column length: 50. m; Column diameter: 0.22 mm |
Capillary | Squalane | 70. | 881.3 | Lunskii and Paizanskaya, 1988 | He; Column length: 50. m; Column diameter: 0.22 mm |

References

Boord, Greenlee, et al., 1946
Boord, C.E.; Greenlee, K.W.; Perilstein, W.L.,
The Synthesis, Purification and Prop. of Hydrocarbons of Low Mol. Weight, Am. Pet. Inst. Res. Proj. 45, Eighth Annu. Rep., Ohio State Univ., June 30, 1946. [all data]
Crane, Boord, et al., 1945
Crane, G.; Boord, C.E.; Henne, A.L.,
The Preparation of Cyclopentenes and Cyclopentanes I.,
J. Am. Chem. Soc., 1945, 67, 1237. [all data]
Boord, Perilstein, et al., 1944
Boord, C.E.; Perilstein, W.L.; Greenlee, K.W.,
, Am. Pet. Inst. Hydrocarbon Res. Proj., Sixth Annu. Ref., Ohio State Univ., Aug. 31, 1944. [all data]
Pines and Ipatieff, 1939
Pines, H.; Ipatieff, V.N.,
J. Am. Chem. Soc., 1939, 61, 2728. [all data]
Lunskii and Paizanskaya, 1988
Lunskii, M.Kh.; Paizanskaya, I.L.,
Identification of hydrocarbons C1-C9 of petrol fractions of oils and condensates in the use of capillary columns with dinonylphthalate,
Zh. Anal. Khim., 1988, 43, 127-135. [all data]