3,3,5,5-Tetramethylcyclopentene
- Formula: C9H16
- Molecular weight: 124.2233
- IUPAC Standard InChIKey: FCJMCOVEXBZEMH-UHFFFAOYSA-N
- CAS Registry Number: 38667-10-6
- Chemical structure:
View 3d structure (requires JavaScript / HTML 5) - Permanent link for this species. Use this link for bookmarking this species for future reference.

Phase change data

Data compiled by: Thermodynamics Research Center, NIST Boulder Laboratories, Chris Muzny director
Quantity | Value | Units | Method | Reference | Comment |
---|---|---|---|---|---|
Tboil | 380.18 | K | N/A | Slomp, 1951 | Uncertainty assigned by TRC = 0.5 K |
Quantity | Value | Units | Method | Reference | Comment |
Tfus | 208.92 | K | N/A | Slomp, 1951 | Uncertainty assigned by TRC = 0.3 K |
Tfus | 208.92 | K | N/A | Anonymous, 1949 | Uncertainty assigned by TRC = 0.5 K |

Normal alkane RI, non-polar column, temperature ramp

Column type | Active phase | I | Reference | Comment |
---|---|---|---|---|
Capillary | CP Sil 8 CB | 852. | Wang and Guo-Y. -L., 2004 | 30. m/0.25 mm/0.25 μm, He, 50. C @ 3. min, 10. K/min, 200. C @ 2. min |

References

Slomp, 1951
Slomp, G.,
, Ph.D. Thesis, Ohio State Univ., Columbus, OH, 1951. [all data]
Anonymous, 1949
Anonymous, R.,
, Am. Pet. Inst. Res. Proj. 45, Ohio State Univ., 1949. [all data]
Wang and Guo-Y. -L., 2004
Wang, H.-Y.; Guo-Y. -L.,
Rapid analysis of the volatile compounds in the rhizomes of Rhodiola sachalinensis and Rhodiola sacra by static headspace-gas chromatography-tandem mass spectrometry,
Anal. Letters, 2004, 37, 10, 2151-2161, https://doi.org/10.1081/AL-200026690
. [all data]