1,1'-Biphenyl, 2,3-dimethyl-
- Formula: C14H14
- Molecular weight: 182.2610
- IUPAC Standard InChIKey: HCAHMRPMYBVHGU-UHFFFAOYSA-N
- CAS Registry Number: 3864-18-4
- Chemical structure:
View 3d structure (requires JavaScript / HTML 5) - Other names: 2,3-dimethylbiphenyl

Kovats' RI, non-polar column, isothermal

Column type | Active phase | Temperature (C) | I | Reference | Comment |
---|---|---|---|---|---|
Packed | Apiezon L | 170. | 1562. | Kríz, Popl, et al., 1974 | |
Packed | Apiezon L | 185. | 1574. | Kríz, Popl, et al., 1974 |

Kovats' RI, polar column, isothermal

Column type | Active phase | Temperature (C) | I | Reference | Comment |
---|---|---|---|---|---|
Capillary | SP-1000 | 185. | 2137. | Kríz, Popl, et al., 1974 | N2; Column length: 50. m; Column diameter: 0.25 mm |
Capillary | SP-1000 | 200. | 2100. | Kríz, Popl, et al., 1974 | N2; Column length: 50. m; Column diameter: 0.25 mm |

References

Kríz, Popl, et al., 1974
Kríz, J.; Popl, M.; Mostecký, J.,
Retention indices of biphenyls and diphenylalkanes,
J. Chromatogr., 1974, 97, 1, 3-13, https://doi.org/10.1016/S0021-9673(01)97577-6
. [all data]