tris(2,2,6,6-tetramethyl-3,5-heptanedionato)ruthenium(III)

Gas phase ion energetics data

Data compiled by: John E. Bartmess

Electron affinity determinations

EA (eV) Method Reference Comment
1.960 ± 0.065IMRBSharpe, Alameddin, et al., 1994EA given is actually -ΔGea(350 K)

Phase change data

Data compiled by: William E. Acree, Jr., James S. Chickos

Enthalpy of sublimation

ΔsubH (kcal/mol) Temperature (K) Method Reference
35.66 ± 0.53353. - 393.MEMorozova, Zherikova, et al., 2009

References

Sharpe, Alameddin, et al., 1994
Sharpe, P.; Alameddin, N.G.; Richardson, D.E., Alkyl Substituent Effects in the Redox Thermochemistry of Coordination Compounds: Oxidation and Reduction Energetics for Ruthenium tris(b-diketonate) Complexes, J. Am. Chem. Soc., 1994, 116, 24, 11098, https://doi.org/10.1021/ja00103a027 . [all data]