Urea-1-dodecene adduct

Phase change data

Data compiled by: Eugene S. Domalski and Elizabeth D. Hearing

Enthalpy of phase transition

ΔHtrs (kJ/mol) Temperature (K) Initial Phase Final Phase Reference Comment
0.42682.0crystaline, IIcrystaline, IGannon and Parsonage, 1972

Entropy of phase transition

ΔStrs (J/mol*K) Temperature (K) Initial Phase Final Phase Reference Comment
5.282.0crystaline, IIcrystaline, IGannon and Parsonage, 1972

References

Gannon and Parsonage, 1972
Gannon, D.J.; Parsonage, N.G., Thermodynamic properties of urea + hydrocarbon adducts from 12 to 300K. The heat capacities and entropies of the adducts of the 1-alkenes C12H24, C14H28, and C18H36, J. Chem. Thermodynam., 1972, 4, 745-753. [all data]