tris N,N-diisobutylamino-1,3,5-triazine

Phase change data

Data compiled by: William E. Acree, Jr., James S. Chickos

Enthalpy of fusion

ΔfusH (kJ/mol) Temperature (K) Reference
35.81372.6Lattermann and Höcker, 1986

References

Lattermann and Höcker, 1986
Lattermann, GÜNter; Höcker, Hartwig, Tris(Dialkylamino)-s-Triazines, Characterization and Thermal Properties, Molecular Crystals and Liquid Crystals, 1986, 133, 3-4, 245-257, https://doi.org/10.1080/00268948608080816 . [all data]