1,4-Dichlorobenzene-D4
- Formula: C6D4Cl2
- Molecular weight: 151.027
- IUPAC Standard InChIKey: OCJBOOLMMGQPQU-RHQRLBAQSA-N
- CAS Registry Number: 3855-82-1
- Chemical structure:
View 3d structure (requires JavaScript / HTML 5) - Isotopologues:
- Other names: 1,4-Dichloro-2,3,5,6-tetradeuterobenzene; Benzene, 1,4-dichloro-, [2H4]

Lee's RI, non-polar column, temperature ramp

Column type | Active phase | I | Reference | Comment |
---|---|---|---|---|
Capillary | DB-5 | 161.5 | Donnelly, Abdel-Hamid, et al., 1993 | 30. m/0.32 mm/0.25 μm, He, 40. C @ 3. min, 8. K/min, 285. C @ 29.5 min |

References

Donnelly, Abdel-Hamid, et al., 1993
Donnelly, J.R.; Abdel-Hamid, M.S.; Jeter, J.L.; Gurka, D.F.,
Application of gas chromatographic retention properties to the identification of environmental contaminants,
J. Chromatogr., 1993, 642, 1-2, 409-415, https://doi.org/10.1016/0021-9673(93)80106-I
. [all data]