isonicotinamide 1-oxide

Phase change data

Data compiled by: William E. Acree, Jr., James S. Chickos

Quantity Value Units Method Reference Comment
Δsub125.3 ± 1.8kJ/molMERibeiro da Silva, Gonçalves, et al., 2001

References

Ribeiro da Silva, Gonçalves, et al., 2001
Ribeiro da Silva, Maria D.M.C.; Gonçalves, Jorge M.; Ferreira, Susana C.C.; da Silva, Luís C.M.; Sottomayor, M.J.; Pilcher, G.; Acree Jr, William E.; Roy, Lindsay E., Experimental thermochemical study of the enthalpies of formation and sublimation of isonicotinamide, picolinamide, nicotinamide, isonicotinamideN-oxide, and nicotinamideN-oxide. The dissociation enthalpies of the N--O bonds, The Journal of Chemical Thermodynamics, 2001, 33, 10, 1263-1275, https://doi.org/10.1006/jcht.2001.0839 . [all data]