3,5-Diethylbenzoic acid
- Formula: C11H14O2
- Molecular weight: 178.2277
- IUPAC Standard InChIKey: MSWNGSGXXVLVPG-UHFFFAOYSA-N
- CAS Registry Number: 3854-90-8
- Chemical structure:
View 3d structure (requires JavaScript / HTML 5) - Permanent link for this species. Use this link for bookmarking this species for future reference.

Gas phase thermochemistry data

Data compiled by: Hussein Y. Afeefy, Joel F. Liebman, and Stephen E. Stein
Quantity | Value | Units | Method | Reference | Comment |
---|---|---|---|---|---|
ΔfH°gas | -407.8 ± 1.6 | kJ/mol | Ccb | Roux, Turrion, et al., 1974 |

Condensed phase thermochemistry data

Data compiled by: Hussein Y. Afeefy, Joel F. Liebman, and Stephen E. Stein
Quantity | Value | Units | Method | Reference | Comment |
---|---|---|---|---|---|
ΔfH°solid | -511.9 ± 1.3 | kJ/mol | Ccb | Roux, Turrion, et al., 1974 | |
Quantity | Value | Units | Method | Reference | Comment |
ΔcH°solid | -5817.6 ± 1.1 | kJ/mol | Ccb | Roux, Turrion, et al., 1974 | Corresponding ΔfHºsolid = -511.87 kJ/mol (simple calculation by NIST; no Washburn corrections) |

Phase change data

Data compiled as indicated in comments:
DRB - Donald R. Burgess, Jr.
AC - William E. Acree, Jr., James S. Chickos
ALS - Hussein Y. Afeefy, Joel F. Liebman, and Stephen E. Stein
Quantity | Value | Units | Method | Reference | Comment |
---|---|---|---|---|---|
ΔsubH° | 104.1 | kJ/mol | N/A | Roux, Turrion, et al., 1974 | DRB |
Enthalpy of sublimation
ΔsubH (kJ/mol) | Temperature (K) | Method | Reference | Comment |
---|---|---|---|---|
104.1 ± 4.2 | 334. | A | Roux, Turrion, et al., 1974, 2 | Based on data from 325. to 343. K. See also Pedley and Rylance, 1977 and Stephenson and Malanowski, 1987.; AC |
104.1 ± 0.4 | 334.0 | V | Roux, Turrion, et al., 1974 | ALS |

References

Roux, Turrion, et al., 1974
Roux, M.V.; Turrion, C.; Colomina, M.; Perez-Ossorio, R.,
Entalpias de combustion y formacion de los acidos 3:5-dietilbenzoico y 3:5-di-t-butilbenzoico,
An. Quim., 1974, 70, 201-207. [all data]
Roux, Turrion, et al., 1974, 2
Roux, M.V.; Turrion, C.; Colomina, M.; Perez-Ossario, R.,
An. Quim., 1974, 70, 201. [all data]
Pedley and Rylance, 1977
Pedley, J.B.; Rylance, J.,
, Computer Analysed Thermochemical Data: Organic and Organometallic Compounds, University of Sussex, Brighton, 1977. [all data]
Stephenson and Malanowski, 1987
Stephenson, Richard M.; Malanowski, Stanislaw,
Handbook of the Thermodynamics of Organic Compounds, 1987, https://doi.org/10.1007/978-94-009-3173-2
. [all data]