2-Butanamine, 3,3-dimethyl-
- Formula: C6H15N
- Molecular weight: 101.1900
- IUPAC Standard InChIKey: DXSUORGKJZADET-UHFFFAOYSA-N
- CAS Registry Number: 3850-30-4
- Chemical structure:
View 3d structure (requires JavaScript / HTML 5) - Other names: Propylamine, 1,2,2-trimethyl-; 1,2,2-Trimethylpropanamine; 1,2,2-Trimethylpropylamine; 2-Amino-3,3-dimethylbutane; 3-Amino-2,2-dimethylbutane; 3,3-Dimethyl-2-aminobutane; 3,3-Dimethylbut-2-ylamine; 3,3-Dimethyl-2-butanamine

Normal alkane RI, polar column, custom temperature program

Column type | Active phase | I | Reference | Comment |
---|---|---|---|---|
Capillary | DB-Wax | 948. | Peng, Yang, et al., 1991 | Program: not specified |

Phase change data

Data compiled as indicated in comments:
BS - Robert L. Brown and Stephen E. Stein
TRC - Thermodynamics Research Center, NIST Boulder Laboratories, Chris Muzny director

Quantity Value Units Method Reference Comment
Tboil375.KN/AAmerican Tokyo Kasei, 1988BS
Tboil374.15KN/AIffland and Yen, 1954Uncertainty assigned by TRC = 3. K; TRC

In addition to the Thermodynamics Research Center (TRC) data available from this site, much more physical and chemical property data is available from the following TRC products:

References

Peng, Yang, et al., 1991
Peng, C.T.; Yang, Z.C.; Ding, S.F.,
Prediction of rentention idexes. II. Structure-retention index relationship on polar columns,
J. Chromatogr., 1991, 586, 1, 85-112, https://doi.org/10.1016/0021-9673(91)80028-F
. [all data]