1,1,1-Trifluoro-2,2-diphemylethane

Condensed phase thermochemistry data

Data compiled by: Hussein Y. Afeefy, Joel F. Liebman, and Stephen E. Stein

Quantity Value Units Method Reference Comment
Δfliquid-585.2 ± 1.1kJ/molCcrSchaffer, Verevkin, et al., 1997
Quantity Value Units Method Reference Comment
Δcliquid-7037.6 ± 1.1kJ/molCcrSchaffer, Verevkin, et al., 1997

References

Schaffer, Verevkin, et al., 1997
Schaffer, F.; Verevkin, S.P.; Rieger, H.J.; Beckhaus, H.D.; Ruchardt, C., Enthalpies of formation of a series of fluorinated hydrocarbons and strain-free group increments to assess polar and anomeric stabilization and strain, Liebigs Ann., 1997, 1333-1344. [all data]