Peroxide, dibutyl
- Formula: C8H18O2
- Molecular weight: 146.2273
- IUPAC Standard InChIKey: PAOHAQSLJSMLAT-UHFFFAOYSA-N
- CAS Registry Number: 3849-34-1
- Chemical structure:
View 3d structure (requires JavaScript / HTML 5) - Species with the same structure:
- Other names: Butyl peroxide; Dibutyl peroxide; (n-C4H9O)2

Condensed phase thermochemistry data

Data compiled by: Hussein Y. Afeefy, Joel F. Liebman, and Stephen E. Stein
Quantity | Value | Units | Method | Reference | Comment |
---|---|---|---|---|---|
ΔcH°liquid | -5326.2 ± 5.0 | kJ/mol | Ccb | Tobolsky and Mesrobian, 1954 | Corresponding ΔfHºliquid = -394. kJ/mol (simple calculation by NIST; no Washburn corrections) |

Phase change data

Data compiled by: Hussein Y. Afeefy, Joel F. Liebman, and Stephen E. Stein
Quantity | Value | Units | Method | Reference | Comment |
---|---|---|---|---|---|
ΔvapH° | 40. | kJ/mol | V | Tobolsky and Mesrobian, 1954 |

References

Tobolsky and Mesrobian, 1954
Tobolsky, A.V.; Mesrobian, R.B.,
Organic Peroxides, Pub. Interscience Publishers, Inc., NYC, 1954, 20. [all data]