1,1'-Biphenyl, 2',3,4-trichloro-
- Formula: C12H7Cl3
- Molecular weight: 257.543
- IUPAC Standard InChIKey: RIMXLXBUOQMDHV-UHFFFAOYSA-N
- CAS Registry Number: 38444-86-9
- Chemical structure:
View 3d structure (requires JavaScript / HTML 5) - Other names: 2,3',4'-Trichlorobiphenyl; 2',3,4-Trichlorobiphenyl; 3,4,2'-Trichlorobiphenyl; 2,3',4'-Trichloro-1,1'-biphenyl; PCB 33

Phase change data

Data compiled by: William E. Acree, Jr., James S. Chickos
Enthalpy of sublimation
ΔsubH (kJ/mol) | Temperature (K) | Method | Reference | Comment |
---|---|---|---|---|
98.2 ± 5.5 | 320. | ME | Nakajoh, Shibata, et al., 2005 | Based on data from 313. to 328. K. |

Kovats' RI, non-polar column, isothermal

Column type | Active phase | Temperature (C) | I | Reference | Comment |
---|---|---|---|---|---|
Capillary | OV-101 | 150. | 1837. | Zell, Neu, et al., 1977 | Column length: 27. m |
Capillary | OV-101 | 150. | 1842. | Zell, Neu, et al., 1977 | Column length: 27. m |
Capillary | OV-101 | 180. | 1858.1 | Krupcik, Leclercq, et al., 1976 | Column length: 50. m |
Capillary | OV-101 | 190. | 1868.2 | Krupcik, Leclercq, et al., 1976 | Column length: 50. m |
Capillary | OV-101 | 200. | 1878.9 | Krupcik, Leclercq, et al., 1976 | Column length: 50. m |
Capillary | OV-101 | 200. | 1878.1 | Krupcik, Leclercq, et al., 1976 | Column length: 50. m |

Van Den Dool and Kratz RI, non-polar column, temperature ramp

Column type | Active phase | I | Reference | Comment |
---|---|---|---|---|
Capillary | Methyl Silicone | 1848.6 | Kozloski, 1985 | He, 5. K/min; Column length: 10. m; Column diameter: 0.21 mm; Tstart: 60. C; Tend: 210. C |
Capillary | Methyl Silicone | 1849. | Kozloski, 1985 | He, 5. K/min; Column length: 10. m; Column diameter: 0.21 mm; Tstart: 60. C; Tend: 210. C |

Normal alkane RI, non-polar column, temperature ramp

Column type | Active phase | I | Reference | Comment |
---|---|---|---|---|
Capillary | HP-5 | 1873. | Zenkevich, Moeder, et al., 2004 | 30. m/0.25 mm/0.25 μm, Helium, 50. C @ 3. min, 3. K/min, 280. C @ 20. min |

References

Nakajoh, Shibata, et al., 2005
Nakajoh, Katsuhiko; Shibata, Etsuro; Todoroki, Tomohiro; Ohara, Atsushi; Nishizawa, Katsushi; Nakamura, Takashi,
VAPOR PRESSURE OF TEN POLYCHLORINATED BIPHENYL CONGENERS AND TWO COMMERCIAL FLUIDS AS A FUNCTION OF TEMPERATURE,
Environ Toxicol Chem, 2005, 24, 7, 1602, https://doi.org/10.1897/04-381R.1
. [all data]
Zell, Neu, et al., 1977
Zell, M.; Neu, H.J.; Ballschmiter, K.,
Identifizierung der PCB-Komponenten durch retentionsindexvergleich nach kapillar-gaschromatographie,
Chemosphere, 1977, 2/3, 2-3, 69-76, https://doi.org/10.1016/0045-6535(77)90047-9
. [all data]
Krupcik, Leclercq, et al., 1976
Krupcik, J.; Leclercq, P.A.; Símová, A.; Suchánek, P.; Collák, M.; Hrivnák, J.,
Possibilities and limitations of capillary gas chromatography and mass spectrometry in the analysis of polychlorinated biphenyls,
J. Chromatogr., 1976, 119, 271-283, https://doi.org/10.1016/S0021-9673(00)86791-6
. [all data]
Kozloski, 1985
Kozloski, R.P.,
Polychlorinated biphenyl retention time standards obtained by chemical dechlorination of polychlorinated biphenyl isomers,
J. Chromatogr., 1985, 318, 211-219, https://doi.org/10.1016/S0021-9673(01)90682-X
. [all data]
Zenkevich, Moeder, et al., 2004
Zenkevich, I.G.; Moeder, M.; Koeller, G.; Schrader, S.,
Using new structurally related additive schemes in the precalculation of gas chromatographic retention indices of polychlorinated hydroxybiphenyls on HP-5 stationary phase,
J. Chromatogr. A, 2004, 1025, 2, 227-236, https://doi.org/10.1016/j.chroma.2003.10.106
. [all data]