1,1'-Biphenyl, 2,2',3,3',6,6'-hexachloro-
- Formula: C12H4Cl6
- Molecular weight: 360.878
- IUPAC Standard InChIKey: FZFUUSROAHKTTF-UHFFFAOYSA-N
- CAS Registry Number: 38411-22-2
- Chemical structure:
View 3d structure (requires JavaScript / HTML 5) - Other names: 2,2',3,3',6,6'-Hexachlorobiphenyl; 2,3,6,2',3',6'-Hexachlorobiphenyl; 2,2',3,3',6,6'-Hexachloro-1,1'-biphenyl; PCB 136

Phase change data

Data compiled as indicated in comments:
TRC - Thermodynamics Research Center, NIST Boulder Laboratories, Chris Muzny director
AC - William E. Acree, Jr., James S. Chickos
Quantity | Value | Units | Method | Reference | Comment |
---|---|---|---|---|---|
Tfus | 385.2 | K | N/A | Miller, Ghodbane, et al., 1984 | Uncertainty assigned by TRC = 0.2 K; TRC |
Enthalpy of fusion
ΔfusH (kcal/mol) | Temperature (K) | Reference | Comment |
---|---|---|---|
5.04 | 385.2 | Acree, 1991 | AC |

Kovats' RI, non-polar column, isothermal

Column type | Active phase | Temperature (C) | I | Reference | Comment |
---|---|---|---|---|---|
Capillary | OV-101 | 150. | 2088. | Zell, Neu, et al., 1977 | Column length: 27. m |
Capillary | OV-101 | 150. | 2090. | Zell, Neu, et al., 1977 | Column length: 27. m |

Normal alkane RI, non-polar column, isothermal

Column type | Active phase | Temperature (C) | I | Reference | Comment |
---|---|---|---|---|---|
Capillary | Apiezon L | 180. | 2124. | Ballschmiter and Zell, 1980 | H2; Column length: 40. m; Column diameter: 0.30 mm |
Capillary | Apiezon L | 180. | 2125. | Ballschmiter and Zell, 1980 | H2; Column length: 40. m; Column diameter: 0.30 mm |
Capillary | Apiezon L | 180. | 2125. | Ballschmiter and Zell, 1980 | H2; Column length: 40. m; Column diameter: 0.30 mm |

Normal alkane RI, non-polar column, temperature ramp

Column type | Active phase | I | Reference | Comment |
---|---|---|---|---|
Capillary | SPB-1 | 2118. | Nakano, Tsuji, et al., 1987 | 30. m/0.25 mm/0.25 μm, 4. K/min; Tstart: 130. C; Tend: 280. C |

Normal alkane RI, non-polar column, custom temperature program

Column type | Active phase | I | Reference | Comment |
---|---|---|---|---|
Capillary | Apolane | 2121. | Bush, Murphy, et al., 1985 | He; Column length: 50. m; Column diameter: 0.25 mm; Program: 70 0C (2 min) 10 0C/min (6 min) 2 0C/min -> 250 0C |

References

Miller, Ghodbane, et al., 1984
Miller, M.M.; Ghodbane, S.; Wasik, S.P.; Tewari, Y.B.; Martire, D.E.,
Aqueous Solubilities, Octanol/Water Partition Coefficients, and Entropies of Melting of Chlorinated Benzenes and Biphenyls,
J. Chem. Eng. Data, 1984, 29, 184-190. [all data]
Acree, 1991
Acree, William E.,
Thermodynamic properties of organic compounds: enthalpy of fusion and melting point temperature compilation,
Thermochimica Acta, 1991, 189, 1, 37-56, https://doi.org/10.1016/0040-6031(91)87098-H
. [all data]
Zell, Neu, et al., 1977
Zell, M.; Neu, H.J.; Ballschmiter, K.,
Identifizierung der PCB-Komponenten durch retentionsindexvergleich nach kapillar-gaschromatographie,
Chemosphere, 1977, 2/3, 2-3, 69-76, https://doi.org/10.1016/0045-6535(77)90047-9
. [all data]
Ballschmiter and Zell, 1980
Ballschmiter, K.; Zell, M.,
Analysis of polychlorinated biphenyls (PCB) by glass capillary gas chromatography,
Fresenius Z. Anal. Chem., 1980, 302, 1, 20-31, https://doi.org/10.1007/BF00469758
. [all data]
Nakano, Tsuji, et al., 1987
Nakano, T.; Tsuji, M.; Okuno, T.,
Analytical methods for PCB using GC/ECD and GC/MS with capillary column,
Report of the Environmental Science Institute of Hyoho Prefecture, 1987, 19, 57-62. [all data]
Bush, Murphy, et al., 1985
Bush, B.; Murphy, M.J.; Connor, S.; Snow, J.; Barnard, E.,
Improvements in Glass Capillary Gas Chromatographic Polychlorobiphenyl Analysis,
J. Chromatogr. Sci., 1985, 23, 11, 509-515, https://doi.org/10.1093/chromsci/23.11.509
. [all data]