Methyl (4S,5R)-2,2,5-trimethyl-1,3-dioxolane-4-carboxylate
- Formula: C8H14O4
- Molecular weight: 174.1944
- IUPAC Standard InChIKey: AELKYRWKHKGMAD-UHFFFAOYSA-N
- CAS Registry Number: 38410-80-9
- Chemical structure:
View 3d structure (requires JavaScript / HTML 5) - Permanent link for this species. Use this link for bookmarking this species for future reference.

Van Den Dool and Kratz RI, non-polar column, custom temperature program

Column type | Active phase | I | Reference | Comment |
---|---|---|---|---|
Capillary | VF-5MS | 1037.5 | Tret'yakov, 2008 | 30. m/0.25 mm/0.25 μm, He; Program: Multi-step temperature program; T(initial)=60C; T(final)=270C |

References

Tret'yakov, 2008
Tret'yakov, K.V.,
Retention Data. NIST Mass Spectrometry Data Center., NIST Mass Spectrometry Data Center, 2008. [all data]