3,4-Dihydrophenanthrene
- Formula: C14H12
- Molecular weight: 180.2451
- IUPAC Standard InChIKey: ZCDATJVTIPPOBN-UHFFFAOYSA-N
- CAS Registry Number: 38399-10-9
- Chemical structure:
View 3d structure (requires JavaScript / HTML 5) - Permanent link for this species. Use this link for bookmarking this species for future reference.

Gas phase thermochemistry data

Data compiled by: Glushko Thermocenter, Russian Academy of Sciences, Moscow
Constant pressure heat capacity of gas
Cp,gas (J/mol*K) | Temperature (K) | Reference | Comment |
---|---|---|---|
44.17 | 50. | Dorofeeva O.V., 1988 | Recommended values were calculated statistically mechanically using force field approximation for polycyclic aromatic hydrocarbons to estimate the needed vibrational frequencies (see also [ Dorofeeva O.V., 1986]). These functions are reproduced in the reference book [ Frenkel M., 1994]. |
67.01 | 100. | ||
93.89 | 150. | ||
124.81 | 200. | ||
174.88 | 273.15 | ||
192.5 ± 2.5 | 298.15 | ||
193.76 | 300. | ||
260.88 | 400. | ||
318.08 | 500. | ||
364.52 | 600. | ||
402.11 | 700. | ||
432.87 | 800. | ||
458.36 | 900. | ||
479.69 | 1000. | ||
497.67 | 1100. | ||
512.93 | 1200. | ||
525.95 | 1300. | ||
537.10 | 1400. | ||
546.71 | 1500. |

References

Dorofeeva O.V., 1988
Dorofeeva O.V.,
Thermodynamic Properties of Polycyclic Aromatic Hydrocarbons in the Gaseous Phase. Institute for High Temperatures, USSR Academy of Sciences, Preprint No.1-238 (in Russian), Moscow, 1988. [all data]
Dorofeeva O.V., 1986
Dorofeeva O.V.,
On calculation of thermodynamic properties of polycyclic aromatic hydrocarbons,
Thermochim. Acta, 1986, 102, 59-66. [all data]
Frenkel M., 1994
Frenkel M.,
Thermodynamics of Organic Compounds in the Gas State, Vol. I, II, Thermodynamics Research Center, College Station, Texas, 1994, 1994. [all data]