o-Cyanobenzoic acid
- Formula: C8H5NO2
- Molecular weight: 147.1308
- IUPAC Standard InChIKey: DTNSDCJFTHMDAK-UHFFFAOYSA-N
- CAS Registry Number: 3839-22-3
- Chemical structure:
View 3d structure (requires JavaScript / HTML 5) - Other names: Benzoic acid, 2-cyano-; 2-Cyanobenzoic acid

Phase change data

Data compiled by: William E. Acree, Jr., James S. Chickos
Quantity | Value | Units | Method | Reference | Comment |
---|---|---|---|---|---|
ΔsubH° | 114.6 ± 1.3 | kJ/mol | C | Ribeiro da Silva, Amaral, et al., 2008 |

References

Ribeiro da Silva, Amaral, et al., 2008
Ribeiro da Silva, Manuel A.V.; Amaral, Luísa M.P.F.; Boaventura, Cristina R.P.; Gomes, José R.B.,
Standard molar enthalpies of formation of 2-, 3- and 4-cyanobenzoic acids,
The Journal of Chemical Thermodynamics, 2008, 40, 8, 1226-1231, https://doi.org/10.1016/j.jct.2008.04.004
. [all data]