Pentane, 3-chloro-2-methyl-
- Formula: C6H13Cl
- Molecular weight: 120.620
- IUPAC Standard InChIKey: FCPXHGJZKRXGJY-UHFFFAOYSA-N
- CAS Registry Number: 38384-05-3
- Chemical structure:
View 3d structure (requires JavaScript / HTML 5) - Other names: 3-Chloro-2-methylpentane

Reaction thermochemistry data

Data compiled by: Hussein Y. Afeefy, Joel F. Liebman, and Stephen E. Stein
Individual Reactions
By formula: C6H13Cl = C6H13Cl
Quantity | Value | Units | Method | Reference | Comment |
---|---|---|---|---|---|
ΔrH° | 8. ± 1. | kJ/mol | Eqk | Andreevskii, Kabo, et al., 1974 | liquid phase; Isomerization |
By formula: C6H13Cl = C6H13Cl
Quantity | Value | Units | Method | Reference | Comment |
---|---|---|---|---|---|
ΔrH° | 3.6 | kJ/mol | Eqk | Andreevskii, Kabo, et al., 1974 | liquid phase; Isomerization |

Kovats' RI, non-polar column, isothermal

Column type | Active phase | Temperature (C) | I | Reference | Comment |
---|---|---|---|---|---|
Packed | Apiezon L | 100. | 850. | Castello and D'Amato, 1986 | |
Packed | Apiezon L | 125. | 862. | Castello and D'Amato, 1986 | |
Packed | Apiezon L | 75. | 845. | Castello and D'Amato, 1986 |

Kovats' RI, polar column, isothermal

Column type | Active phase | Temperature (C) | I | Reference | Comment |
---|---|---|---|---|---|
Packed | Carbowax 20M | 100. | 952. | Castello and D'Amato, 1986 | He, Chromosorb W AW DMC; Column length: 3. m |
Packed | Carbowax 20M | 125. | 956. | Castello and D'Amato, 1986 | He, Chromosorb W AW DMC; Column length: 3. m |
Packed | Carbowax 20M | 75. | 944. | Castello and D'Amato, 1986 | He, Chromosorb W AW DMC; Column length: 3. m |

References

Andreevskii, Kabo, et al., 1974
Andreevskii, D.N.; Kabo, G.Ya.; Esipenok, G.E.,
Equilibria and thermodynamics of the isomerisation of methylchloropentanes,
Russ. J. Phys. Chem. (Engl. Transl.), 1974, 48, 955. [all data]
Castello and D'Amato, 1986
Castello, G.; D'Amato, G.,
Gas chromatographic separation and identification of linear and branched-chain alkyl chlorides,
J. Chromatogr., 1986, 354, 65-74, https://doi.org/10.1016/S0021-9673(01)87011-4
. [all data]