Glycine, N-(trifluoroacetyl)-, methyl ester
- Formula: C5H6F3NO3
- Molecular weight: 185.1012
- IUPAC Standard InChIKey: BTZLVUPFAOBHFS-UHFFFAOYSA-N
- CAS Registry Number: 383-72-2
- Chemical structure:
View 3d structure (requires JavaScript / HTML 5) - Other names: Methyl [(trifluoroacetyl)amino]acetate

Phase change data

Data compiled by: William E. Acree, Jr., James S. Chickos
Enthalpy of sublimation
ΔsubH (kJ/mol) | Temperature (K) | Reference | Comment |
---|---|---|---|
57.3 | 308. | Stephenson and Malanowski, 1987 | Based on data from 293. to 463. K. See also Weygand, Klipping, et al., 1960. |

Van Den Dool and Kratz RI, non-polar column, temperature ramp

Column type | Active phase | I | Reference | Comment |
---|---|---|---|---|
Capillary | VF-5MS | 955. | Todua, 2011 | 30. m/0.25 mm/0.25 μm, He; Tstart: 60. C; Tend: 270. C |

References

Stephenson and Malanowski, 1987
Stephenson, Richard M.; Malanowski, Stanislaw,
Handbook of the Thermodynamics of Organic Compounds, 1987, https://doi.org/10.1007/978-94-009-3173-2
. [all data]
Weygand, Klipping, et al., 1960
Weygand, Friedrich; Klipping, Gustav; Palm, Dieter,
N-Trifluoracetyl-aminosäuren, XVIII. Dampfdruckmessungen anN-TFA-Aminosäuren, -Peptiden und ihren Estern,
Chem. Ber., 1960, 93, 11, 2619-2625, https://doi.org/10.1002/cber.19600931129
. [all data]
Todua, 2011
Todua, N.G.,
Retention Data. NIST Mass Spectrometry Data Center., NIST Mass Spectrometry Data Center, 2011. [all data]