Allyl trifluoroacetate
- Formula: C5H5F3O2
- Molecular weight: 154.0872
- IUPAC Standard InChIKey: XIVPVSIDXBTZLM-UHFFFAOYSA-N
- CAS Registry Number: 383-67-5
- Chemical structure:
View 3d structure (requires JavaScript / HTML 5) - Other names: Allyl trifluoracetate; Acetic acid, trifluoro-, 2-propenyl ester; Acetic acid, trifluoro-, allyl ester; Trifluoroacetic acid, 2-propenyl ester; Allyl alcohol, trifluoroacetate

Van Den Dool and Kratz RI, non-polar column, custom temperature program

Column type | Active phase | I | Reference | Comment |
---|---|---|---|---|
Capillary | VF-5MS | 708.3 | Tret'yakov, 2008 | 30. m/0.25 mm/0.25 μm, He; Program: Multi-step temperature program; T(initial)=60C; T(final)=270C |

References

Tret'yakov, 2008
Tret'yakov, K.V.,
Retention Data. NIST Mass Spectrometry Data Center., NIST Mass Spectrometry Data Center, 2008. [all data]