trans-3,5-Diethyl-1,2,4-trithiolane
- Formula: C6H12S3
- Molecular weight: 180.354
- IUPAC Standard InChIKey: WQXXXHMEBYGSBG-WDSKDSINSA-N
- CAS Registry Number: 38348-26-4
- Chemical structure:
View 3d structure (requires JavaScript / HTML 5) - Stereoisomers:
- Other names: 3,5-Diethyl-1,2,4-trithiolane, (E)-

Van Den Dool and Kratz RI, polar column, temperature ramp

Column type | Active phase | I | Reference | Comment |
---|---|---|---|---|
Capillary | DB-Wax | 1795. | Aromdee and Sriubolmas, 2006 | 30. m/0.25 mm/0.25 μm, He, 40. C @ 5. min, 3. K/min, 250. C @ 10. min |

Normal alkane RI, non-polar column, temperature ramp

Column type | Active phase | I | Reference | Comment |
---|---|---|---|---|
Capillary | HP-5 | 1333. | Kubec, Velísek, et al., 1997 | 30. m/0.25 mm/0.25 μm, N2, 40. C @ 3. min, 4. K/min, 240. C @ 10. min |

Normal alkane RI, polar column, temperature ramp

Column type | Active phase | I | Reference | Comment |
---|---|---|---|---|
Capillary | TC-FFAP | 1797. | Kurose and Yatagai, 2005 | 60. m/0.25 mm/0.4 μm, He, 3. K/min, 220. C @ 30. min; Tstart: 60. C |
Capillary | HP-Innowax | 1811. | Kubec, Velísek, et al., 1997 | 30. m/0.25 mm/0.5 μm, N2, 40. C @ 3. min, 4. K/min; Tend: 190. C |

References

Aromdee and Sriubolmas, 2006
Aromdee, C.; Sriubolmas, N.,
Essential oil of the flowers of Azadirachta indica (Meliaceae),
Songklanakarin J. Sci. Technol., 2006, 28, 1, 115-119. [all data]
Kubec, Velísek, et al., 1997
Kubec, R.; Velísek, J.; Dolezal, M.; Kubelka, V.,
Sulfur-containing volatiles arising by thermal degradation of alliin and deoxyalliin,
J. Agric. Food Chem., 1997, 45, 9, 3580-3585, https://doi.org/10.1021/jf970071q
. [all data]
Kurose and Yatagai, 2005
Kurose, K.; Yatagai, M.,
Components of the essential oils of Azadirachta indica A. Juss, Azadirachta siamensis Velton, and Azadirachta excelsa (Jack) Jacobs and their comparison,
J. Wood Sci., 2005, 51, 2, 185-188, https://doi.org/10.1007/s10086-004-0640-4
. [all data]