Bromodifluoroacetylchloride
- Formula: C2BrClF2O
- Molecular weight: 193.375
- IUPAC Standard InChIKey: LYJKGSALBRSKNL-UHFFFAOYSA-N
- CAS Registry Number: 3832-48-2
- Chemical structure:
View 3d structure (requires JavaScript / HTML 5) - Permanent link for this species. Use this link for bookmarking this species for future reference.

Phase change data

Data compiled by: Thermodynamics Research Center, NIST Boulder Laboratories, Chris Muzny director
Quantity | Value | Units | Method | Reference | Comment |
---|---|---|---|---|---|
Tboil | 323. | K | N/A | Anonymous, 1957 | Uncertainty assigned by TRC = 5. K |

References

Anonymous, 1957
Anonymous, P.,
, 1957. [all data]