1,2,4-Tribromobutane
- Formula: C4H7Br3
- Molecular weight: 294.810
- IUPAC Standard InChIKey: UKFHIKGQGFCINK-UHFFFAOYSA-N
- CAS Registry Number: 38300-67-3
- Chemical structure:
View 3d structure (requires JavaScript / HTML 5) - Permanent link for this species. Use this link for bookmarking this species for future reference.

Phase change data

Data compiled as indicated in comments:
TRC - Thermodynamics Research Center, NIST Boulder Laboratories, Chris Muzny director
AC - William E. Acree, Jr., James S. Chickos
Quantity | Value | Units | Method | Reference | Comment |
---|---|---|---|---|---|
Tfus | 256. | K | N/A | Buchman and Conly, 1953 | Uncertainty assigned by TRC = 7. K; TRC |
Enthalpy of vaporization
ΔvapH (kJ/mol) | Temperature (K) | Method | Reference | Comment |
---|---|---|---|---|
53.5 | 405. | A | Stephenson and Malanowski, 1987 | Based on data from 390. to 541. K. See also Dykyj, 1971.; AC |

References

Buchman and Conly, 1953
Buchman, E.R.; Conly, J.C.,
The Reaction of Silver Cyclobutanecarboxylate with Bromine,
J. Am. Chem. Soc., 1953, 75, 1990. [all data]
Stephenson and Malanowski, 1987
Stephenson, Richard M.; Malanowski, Stanislaw,
Handbook of the Thermodynamics of Organic Compounds, 1987, https://doi.org/10.1007/978-94-009-3173-2
. [all data]
Dykyj, 1971
Dykyj, J.,
Petrochemia, 1971, 11, 2, 27. [all data]